Build #28

Build: #28 failed Changes by Dawid Weiss

Stages & jobs

  1. Compile and test

  2. Package

Build result summary

Details

Completed
Duration
35 seconds
Labels
None
Revision
e3c14612eebbd382fb809cd62c30f71bab52a5b3 e3c14612eebbd382fb809cd62c30f71bab52a5b3
Total tests
10146
Failing since
#27 (Changes by Dawid Weiss)
Fixed in
#29 (Manual run by Dawid Weiss)

Responsible

Code commits

Author Commit Message Commit date
Dawid Weiss Dawid Weiss e3c14612eebbd382fb809cd62c30f71bab52a5b3 e3c14612eebbd382fb809cd62c30f71bab52a5b3 Removed unused imports.

Tests

New test failures 2
Status Test View job Duration
Collapse Failed ObjectLongOpenIdentityHashMapTest testClear History
JDK 1.7 < 1 sec
java.lang.AssertionError: expected:<true> but was:<false>
	at org.junit.Assert.fail(Assert.java:88)
	at org.junit.Assert.failNotEquals(Assert.java:743)
	at org.junit.Assert.assertEquals(Assert.java:118)
	at org.junit.Assert.assertEquals(Assert.java:144)
	at com.carrotsearch.hppc.ObjectLongOpenIdentityHashMapTest.testPutWithExpansions(ObjectLongOpenIdentityHashMapTest.java:179)
	at com.carrotsearch.hppc.ObjectLongOpenIdentityHashMapTest.testClear(ObjectLongOpenIdentityHashMapTest.java:363)
	at sun.reflect.NativeMethodAccessorImpl.invoke0(Native Method)
(20 more lines...)
Collapse Failed ObjectShortOpenIdentityHashMapTest testPutWithExpansions History
JDK 1.6 < 1 sec
java.lang.AssertionError: expected:<true> but was:<false>
	at org.junit.Assert.fail(Assert.java:88)
	at org.junit.Assert.failNotEquals(Assert.java:743)
	at org.junit.Assert.assertEquals(Assert.java:118)
	at org.junit.Assert.assertEquals(Assert.java:144)
	at com.carrotsearch.hppc.ObjectShortOpenIdentityHashMapTest.testPutWithExpansions(ObjectShortOpenIdentityHashMapTest.java:179)
	at sun.reflect.NativeMethodAccessorImpl.invoke0(Native Method)
	at sun.reflect.NativeMethodAccessorImpl.invoke(NativeMethodAccessorImpl.java:57)
(19 more lines...)
Existing test failures 13
Status Test Failing since View job Duration
java.lang.AssertionError: expected:<800458591> but was:<1271153891>
	at org.junit.Assert.fail(Assert.java:88)
	at org.junit.Assert.failNotEquals(Assert.java:743)
	at org.junit.Assert.assertEquals(Assert.java:118)
	at org.junit.Assert.assertEquals(Assert.java:555)
	at org.junit.Assert.assertEquals(Assert.java:542)
	at com.carrotsearch.hppc.ObjectDoubleOpenIdentityHashMapTest.testHashCodeEquals(ObjectDoubleOpenIdentityHashMapTest.java:514)
	at sun.reflect.NativeMethodAccessorImpl.invoke0(Native Method)
(20 more lines...)
java.lang.AssertionError: expected:<-1444533387> but was:<-347025437>
	at org.junit.Assert.fail(Assert.java:88)
	at org.junit.Assert.failNotEquals(Assert.java:743)
	at org.junit.Assert.assertEquals(Assert.java:118)
	at org.junit.Assert.assertEquals(Assert.java:555)
	at org.junit.Assert.assertEquals(Assert.java:542)
	at com.carrotsearch.hppc.ObjectDoubleOpenIdentityHashMapTest.testHashCodeEqualsDifferentPerturbance(ObjectDoubleOpenIdentityHashMapTest.java:555)
	at sun.reflect.NativeMethodAccessorImpl.invoke0(Native Method)
(20 more lines...)
java.lang.AssertionError: expected:<348196966> but was:<1869675869>
	at org.junit.Assert.fail(Assert.java:88)
	at org.junit.Assert.failNotEquals(Assert.java:743)
	at org.junit.Assert.assertEquals(Assert.java:118)
	at org.junit.Assert.assertEquals(Assert.java:555)
	at org.junit.Assert.assertEquals(Assert.java:542)
	at com.carrotsearch.hppc.ObjectDoubleOpenIdentityHashMapTest.testHashCodeEquals(ObjectDoubleOpenIdentityHashMapTest.java:514)
	at sun.reflect.NativeMethodAccessorImpl.invoke0(Native Method)
(20 more lines...)
java.lang.AssertionError: expected:<2132564146> but was:<1280318645>
	at org.junit.Assert.fail(Assert.java:88)
	at org.junit.Assert.failNotEquals(Assert.java:743)
	at org.junit.Assert.assertEquals(Assert.java:118)
	at org.junit.Assert.assertEquals(Assert.java:555)
	at org.junit.Assert.assertEquals(Assert.java:542)
	at com.carrotsearch.hppc.ObjectDoubleOpenIdentityHashMapTest.testHashCodeEqualsDifferentPerturbance(ObjectDoubleOpenIdentityHashMapTest.java:555)
	at sun.reflect.NativeMethodAccessorImpl.invoke0(Native Method)
(20 more lines...)
java.lang.AssertionError: expected:<-1674348496> but was:<-1376232155>
	at org.junit.Assert.fail(Assert.java:88)
	at org.junit.Assert.failNotEquals(Assert.java:743)
	at org.junit.Assert.assertEquals(Assert.java:118)
	at org.junit.Assert.assertEquals(Assert.java:555)
	at org.junit.Assert.assertEquals(Assert.java:542)
	at com.carrotsearch.hppc.ObjectDoubleOpenIdentityHashMapTest.testHashCodeEquals(ObjectDoubleOpenIdentityHashMapTest.java:514)
	at sun.reflect.NativeMethodAccessorImpl.invoke0(Native Method)
(20 more lines...)
java.lang.AssertionError: expected:<1203073501> but was:<-1591907041>
	at org.junit.Assert.fail(Assert.java:88)
	at org.junit.Assert.failNotEquals(Assert.java:743)
	at org.junit.Assert.assertEquals(Assert.java:118)
	at org.junit.Assert.assertEquals(Assert.java:555)
	at org.junit.Assert.assertEquals(Assert.java:542)
	at com.carrotsearch.hppc.ObjectDoubleOpenIdentityHashMapTest.testHashCodeEqualsDifferentPerturbance(ObjectDoubleOpenIdentityHashMapTest.java:555)
	at sun.reflect.NativeMethodAccessorImpl.invoke0(Native Method)
(20 more lines...)
java.lang.AssertionError: expected:<-236706839> but was:<2096217956>
	at org.junit.Assert.fail(Assert.java:88)
	at org.junit.Assert.failNotEquals(Assert.java:743)
	at org.junit.Assert.assertEquals(Assert.java:118)
	at org.junit.Assert.assertEquals(Assert.java:555)
	at org.junit.Assert.assertEquals(Assert.java:542)
	at com.carrotsearch.hppc.ObjectFloatOpenIdentityHashMapTest.testHashCodeEquals(ObjectFloatOpenIdentityHashMapTest.java:514)
	at sun.reflect.NativeMethodAccessorImpl.invoke0(Native Method)
(20 more lines...)
java.lang.AssertionError: expected:<329017827> but was:<1984919570>
	at org.junit.Assert.fail(Assert.java:88)
	at org.junit.Assert.failNotEquals(Assert.java:743)
	at org.junit.Assert.assertEquals(Assert.java:118)
	at org.junit.Assert.assertEquals(Assert.java:555)
	at org.junit.Assert.assertEquals(Assert.java:542)
	at com.carrotsearch.hppc.ObjectFloatOpenIdentityHashMapTest.testHashCodeEqualsDifferentPerturbance(ObjectFloatOpenIdentityHashMapTest.java:555)
	at sun.reflect.NativeMethodAccessorImpl.invoke0(Native Method)
(20 more lines...)
java.lang.AssertionError: expected:<1177033590> but was:<472987853>
	at org.junit.Assert.fail(Assert.java:88)
	at org.junit.Assert.failNotEquals(Assert.java:743)
	at org.junit.Assert.assertEquals(Assert.java:118)
	at org.junit.Assert.assertEquals(Assert.java:555)
	at org.junit.Assert.assertEquals(Assert.java:542)
	at com.carrotsearch.hppc.ObjectFloatOpenIdentityHashMapTest.testHashCodeEquals(ObjectFloatOpenIdentityHashMapTest.java:514)
	at sun.reflect.NativeMethodAccessorImpl.invoke0(Native Method)
(20 more lines...)
java.lang.AssertionError: expected:<true> but was:<false>
	at org.junit.Assert.fail(Assert.java:88)
	at org.junit.Assert.failNotEquals(Assert.java:743)
	at org.junit.Assert.assertEquals(Assert.java:118)
	at org.junit.Assert.assertEquals(Assert.java:144)
	at com.carrotsearch.hppc.ObjectFloatOpenIdentityHashMapTest.testPutWithExpansions(ObjectFloatOpenIdentityHashMapTest.java:179)
	at com.carrotsearch.hppc.ObjectFloatOpenIdentityHashMapTest.testClear(ObjectFloatOpenIdentityHashMapTest.java:363)
	at sun.reflect.NativeMethodAccessorImpl.invoke0(Native Method)
(20 more lines...)
java.lang.AssertionError: expected:<786674033> but was:<1971622109>
	at org.junit.Assert.fail(Assert.java:88)
	at org.junit.Assert.failNotEquals(Assert.java:743)
	at org.junit.Assert.assertEquals(Assert.java:118)
	at org.junit.Assert.assertEquals(Assert.java:555)
	at org.junit.Assert.assertEquals(Assert.java:542)
	at com.carrotsearch.hppc.ObjectFloatOpenIdentityHashMapTest.testHashCodeEqualsDifferentPerturbance(ObjectFloatOpenIdentityHashMapTest.java:555)
	at sun.reflect.NativeMethodAccessorImpl.invoke0(Native Method)
(20 more lines...)
java.lang.AssertionError: expected:<1336238099> but was:<-1017171971>
	at org.junit.Assert.fail(Assert.java:88)
	at org.junit.Assert.failNotEquals(Assert.java:743)
	at org.junit.Assert.assertEquals(Assert.java:118)
	at org.junit.Assert.assertEquals(Assert.java:555)
	at org.junit.Assert.assertEquals(Assert.java:542)
	at com.carrotsearch.hppc.ObjectFloatOpenIdentityHashMapTest.testHashCodeEquals(ObjectFloatOpenIdentityHashMapTest.java:514)
	at sun.reflect.NativeMethodAccessorImpl.invoke0(Native Method)
(20 more lines...)
java.lang.AssertionError: expected:<-1898469998> but was:<-338022114>
	at org.junit.Assert.fail(Assert.java:88)
	at org.junit.Assert.failNotEquals(Assert.java:743)
	at org.junit.Assert.assertEquals(Assert.java:118)
	at org.junit.Assert.assertEquals(Assert.java:555)
	at org.junit.Assert.assertEquals(Assert.java:542)
	at com.carrotsearch.hppc.ObjectFloatOpenIdentityHashMapTest.testHashCodeEqualsDifferentPerturbance(ObjectFloatOpenIdentityHashMapTest.java:555)
	at sun.reflect.NativeMethodAccessorImpl.invoke0(Native Method)
(20 more lines...)