Build #27

Build: #27 failed Changes by Dawid Weiss

Stages & jobs

  1. Compile and test

  2. Package

Build result summary

Details

Completed
Duration
37 seconds
Labels
None
Revision
65a4f2cdc119e473c7dcd30a5ee53652f6c32dd3 65a4f2cdc119e473c7dcd30a5ee53652f6c32dd3
Total tests
10146
Fixed in
#29 (Manual run by Dawid Weiss)

Tests

Responsible

Code commits

Author Commit Message Commit date
Dawid Weiss Dawid Weiss 65a4f2cdc119e473c7dcd30a5ee53652f6c32dd3 65a4f2cdc119e473c7dcd30a5ee53652f6c32dd3 Added tests of identity maps.

Tests

New test failures 13
Status Test View job Duration
Collapse Failed ObjectDoubleOpenIdentityHashMapTest testHashCodeEquals History
JDK 1.6 < 1 sec
java.lang.AssertionError: expected:<-1688595595> but was:<936007265>
	at org.junit.Assert.fail(Assert.java:88)
	at org.junit.Assert.failNotEquals(Assert.java:743)
	at org.junit.Assert.assertEquals(Assert.java:118)
	at org.junit.Assert.assertEquals(Assert.java:555)
	at org.junit.Assert.assertEquals(Assert.java:542)
	at com.carrotsearch.hppc.ObjectDoubleOpenIdentityHashMapTest.testHashCodeEquals(ObjectDoubleOpenIdentityHashMapTest.java:515)
	at sun.reflect.NativeMethodAccessorImpl.invoke0(Native Method)
(20 more lines...)
Collapse Failed ObjectDoubleOpenIdentityHashMapTest testHashCodeEqualsDifferentPerturbance History
JDK 1.6 < 1 sec
java.lang.AssertionError: expected:<140202935> but was:<878798876>
	at org.junit.Assert.fail(Assert.java:88)
	at org.junit.Assert.failNotEquals(Assert.java:743)
	at org.junit.Assert.assertEquals(Assert.java:118)
	at org.junit.Assert.assertEquals(Assert.java:555)
	at org.junit.Assert.assertEquals(Assert.java:542)
	at com.carrotsearch.hppc.ObjectDoubleOpenIdentityHashMapTest.testHashCodeEqualsDifferentPerturbance(ObjectDoubleOpenIdentityHashMapTest.java:556)
	at sun.reflect.NativeMethodAccessorImpl.invoke0(Native Method)
(20 more lines...)
Collapse Failed ObjectDoubleOpenIdentityHashMapTest testHashCodeEquals History
JDK 1.7 < 1 sec
java.lang.AssertionError: expected:<-1135407661> but was:<1323447002>
	at org.junit.Assert.fail(Assert.java:88)
	at org.junit.Assert.failNotEquals(Assert.java:743)
	at org.junit.Assert.assertEquals(Assert.java:118)
	at org.junit.Assert.assertEquals(Assert.java:555)
	at org.junit.Assert.assertEquals(Assert.java:542)
	at com.carrotsearch.hppc.ObjectDoubleOpenIdentityHashMapTest.testHashCodeEquals(ObjectDoubleOpenIdentityHashMapTest.java:515)
	at sun.reflect.NativeMethodAccessorImpl.invoke0(Native Method)
(20 more lines...)
Collapse Failed ObjectDoubleOpenIdentityHashMapTest testHashCodeEqualsDifferentPerturbance History
JDK 1.7 < 1 sec
java.lang.AssertionError: expected:<-889942484> but was:<182921803>
	at org.junit.Assert.fail(Assert.java:88)
	at org.junit.Assert.failNotEquals(Assert.java:743)
	at org.junit.Assert.assertEquals(Assert.java:118)
	at org.junit.Assert.assertEquals(Assert.java:555)
	at org.junit.Assert.assertEquals(Assert.java:542)
	at com.carrotsearch.hppc.ObjectDoubleOpenIdentityHashMapTest.testHashCodeEqualsDifferentPerturbance(ObjectDoubleOpenIdentityHashMapTest.java:556)
	at sun.reflect.NativeMethodAccessorImpl.invoke0(Native Method)
(20 more lines...)
Collapse Failed ObjectDoubleOpenIdentityHashMapTest testHashCodeEquals History
JDK 1.8 < 1 sec
java.lang.AssertionError: expected:<1238908127> but was:<-1660007778>
	at org.junit.Assert.fail(Assert.java:88)
	at org.junit.Assert.failNotEquals(Assert.java:743)
	at org.junit.Assert.assertEquals(Assert.java:118)
	at org.junit.Assert.assertEquals(Assert.java:555)
	at org.junit.Assert.assertEquals(Assert.java:542)
	at com.carrotsearch.hppc.ObjectDoubleOpenIdentityHashMapTest.testHashCodeEquals(ObjectDoubleOpenIdentityHashMapTest.java:515)
	at sun.reflect.NativeMethodAccessorImpl.invoke0(Native Method)
(20 more lines...)
Collapse Failed ObjectDoubleOpenIdentityHashMapTest testHashCodeEqualsDifferentPerturbance History
JDK 1.8 < 1 sec
java.lang.AssertionError: expected:<-177145841> but was:<1824675310>
	at org.junit.Assert.fail(Assert.java:88)
	at org.junit.Assert.failNotEquals(Assert.java:743)
	at org.junit.Assert.assertEquals(Assert.java:118)
	at org.junit.Assert.assertEquals(Assert.java:555)
	at org.junit.Assert.assertEquals(Assert.java:542)
	at com.carrotsearch.hppc.ObjectDoubleOpenIdentityHashMapTest.testHashCodeEqualsDifferentPerturbance(ObjectDoubleOpenIdentityHashMapTest.java:556)
	at sun.reflect.NativeMethodAccessorImpl.invoke0(Native Method)
(20 more lines...)
Collapse Failed ObjectFloatOpenIdentityHashMapTest testHashCodeEquals History
JDK 1.6 < 1 sec
java.lang.AssertionError: expected:<-734431768> but was:<2014914447>
	at org.junit.Assert.fail(Assert.java:88)
	at org.junit.Assert.failNotEquals(Assert.java:743)
	at org.junit.Assert.assertEquals(Assert.java:118)
	at org.junit.Assert.assertEquals(Assert.java:555)
	at org.junit.Assert.assertEquals(Assert.java:542)
	at com.carrotsearch.hppc.ObjectFloatOpenIdentityHashMapTest.testHashCodeEquals(ObjectFloatOpenIdentityHashMapTest.java:515)
	at sun.reflect.NativeMethodAccessorImpl.invoke0(Native Method)
(20 more lines...)
Collapse Failed ObjectFloatOpenIdentityHashMapTest testHashCodeEqualsDifferentPerturbance History
JDK 1.6 < 1 sec
java.lang.AssertionError: expected:<-892455367> but was:<372459504>
	at org.junit.Assert.fail(Assert.java:88)
	at org.junit.Assert.failNotEquals(Assert.java:743)
	at org.junit.Assert.assertEquals(Assert.java:118)
	at org.junit.Assert.assertEquals(Assert.java:555)
	at org.junit.Assert.assertEquals(Assert.java:542)
	at com.carrotsearch.hppc.ObjectFloatOpenIdentityHashMapTest.testHashCodeEqualsDifferentPerturbance(ObjectFloatOpenIdentityHashMapTest.java:556)
	at sun.reflect.NativeMethodAccessorImpl.invoke0(Native Method)
(20 more lines...)
Collapse Failed ObjectFloatOpenIdentityHashMapTest testHashCodeEquals History
JDK 1.7 < 1 sec
java.lang.AssertionError: expected:<-193507116> but was:<-453727302>
	at org.junit.Assert.fail(Assert.java:88)
	at org.junit.Assert.failNotEquals(Assert.java:743)
	at org.junit.Assert.assertEquals(Assert.java:118)
	at org.junit.Assert.assertEquals(Assert.java:555)
	at org.junit.Assert.assertEquals(Assert.java:542)
	at com.carrotsearch.hppc.ObjectFloatOpenIdentityHashMapTest.testHashCodeEquals(ObjectFloatOpenIdentityHashMapTest.java:515)
	at sun.reflect.NativeMethodAccessorImpl.invoke0(Native Method)
(20 more lines...)
Collapse Failed ObjectFloatOpenIdentityHashMapTest testClear History
JDK 1.7 < 1 sec
java.lang.AssertionError: expected:<true> but was:<false>
	at org.junit.Assert.fail(Assert.java:88)
	at org.junit.Assert.failNotEquals(Assert.java:743)
	at org.junit.Assert.assertEquals(Assert.java:118)
	at org.junit.Assert.assertEquals(Assert.java:144)
	at com.carrotsearch.hppc.ObjectFloatOpenIdentityHashMapTest.testPutWithExpansions(ObjectFloatOpenIdentityHashMapTest.java:180)
	at com.carrotsearch.hppc.ObjectFloatOpenIdentityHashMapTest.testClear(ObjectFloatOpenIdentityHashMapTest.java:364)
	at sun.reflect.NativeMethodAccessorImpl.invoke0(Native Method)
(20 more lines...)
Collapse Failed ObjectFloatOpenIdentityHashMapTest testHashCodeEqualsDifferentPerturbance History
JDK 1.7 < 1 sec
java.lang.AssertionError: expected:<-1427031775> but was:<-1336754099>
	at org.junit.Assert.fail(Assert.java:88)
	at org.junit.Assert.failNotEquals(Assert.java:743)
	at org.junit.Assert.assertEquals(Assert.java:118)
	at org.junit.Assert.assertEquals(Assert.java:555)
	at org.junit.Assert.assertEquals(Assert.java:542)
	at com.carrotsearch.hppc.ObjectFloatOpenIdentityHashMapTest.testHashCodeEqualsDifferentPerturbance(ObjectFloatOpenIdentityHashMapTest.java:556)
	at sun.reflect.NativeMethodAccessorImpl.invoke0(Native Method)
(20 more lines...)
Collapse Failed ObjectFloatOpenIdentityHashMapTest testHashCodeEquals History
JDK 1.8 < 1 sec
java.lang.AssertionError: expected:<-1056283726> but was:<-725087620>
	at org.junit.Assert.fail(Assert.java:88)
	at org.junit.Assert.failNotEquals(Assert.java:743)
	at org.junit.Assert.assertEquals(Assert.java:118)
	at org.junit.Assert.assertEquals(Assert.java:555)
	at org.junit.Assert.assertEquals(Assert.java:542)
	at com.carrotsearch.hppc.ObjectFloatOpenIdentityHashMapTest.testHashCodeEquals(ObjectFloatOpenIdentityHashMapTest.java:515)
	at sun.reflect.NativeMethodAccessorImpl.invoke0(Native Method)
(20 more lines...)
Collapse Failed ObjectFloatOpenIdentityHashMapTest testHashCodeEqualsDifferentPerturbance History
JDK 1.8 < 1 sec
java.lang.AssertionError: expected:<-1736983274> but was:<-536642589>
	at org.junit.Assert.fail(Assert.java:88)
	at org.junit.Assert.failNotEquals(Assert.java:743)
	at org.junit.Assert.assertEquals(Assert.java:118)
	at org.junit.Assert.assertEquals(Assert.java:555)
	at org.junit.Assert.assertEquals(Assert.java:542)
	at com.carrotsearch.hppc.ObjectFloatOpenIdentityHashMapTest.testHashCodeEqualsDifferentPerturbance(ObjectFloatOpenIdentityHashMapTest.java:556)
	at sun.reflect.NativeMethodAccessorImpl.invoke0(Native Method)
(20 more lines...)