Build #135

Build: #135 failed Changes by Dawid Weiss

Stages & jobs

  1. Compile and test

  2. Package

Logs

The following logs have been generated by the jobs in this plan.
  • Expand all
  • Collapse all
Job Logs
Collapse JDK 1.8 Compile and test Download or View
29-Jul-2020 13:38:58 [INFO] Scanning for projects...
29-Jul-2020 13:38:58 [INFO] ------------------------------------------------------------------------
29-Jul-2020 13:38:58 [INFO] BUILD FAILURE
29-Jul-2020 13:38:58 [INFO] ------------------------------------------------------------------------
29-Jul-2020 13:38:58 [INFO] Total time:  0.056 s
29-Jul-2020 13:38:58 [INFO] Finished at: 2020-07-29T13:38:58+02:00
29-Jul-2020 13:38:58 [INFO] ------------------------------------------------------------------------
29-Jul-2020 13:38:58 [ERROR] The goal you specified requires a project to execute but there is no POM in this directory (/var/atlassian/application-data/bamboo/xml-data/build-dir/HPPC-SOFTWARE-JDK18). Please verify you invoked Maven from the correct directory. -> [Help 1]
29-Jul-2020 13:38:58 [ERROR]
29-Jul-2020 13:38:58 [ERROR] To see the full stack trace of the errors, re-run Maven with the -e switch.
29-Jul-2020 13:38:58 [ERROR] Re-run Maven using the -X switch to enable full debug logging.
29-Jul-2020 13:38:58 [ERROR]
29-Jul-2020 13:38:58 [ERROR] For more information about the errors and possible solutions, please read the following articles:
29-Jul-2020 13:38:58 [ERROR] [Help 1] http://cwiki.apache.org/confluence/display/MAVEN/MissingProjectException
Collapse JDK 11 Compile and test Download or View
29-Jul-2020 13:38:59 [INFO] Scanning for projects...
29-Jul-2020 13:38:59 [INFO] ------------------------------------------------------------------------
29-Jul-2020 13:38:59 [INFO] BUILD FAILURE
29-Jul-2020 13:38:59 [INFO] ------------------------------------------------------------------------
29-Jul-2020 13:38:59 [INFO] Total time:  0.046 s
29-Jul-2020 13:38:59 [INFO] Finished at: 2020-07-29T13:38:59+02:00
29-Jul-2020 13:38:59 [INFO] ------------------------------------------------------------------------
29-Jul-2020 13:38:59 [ERROR] The goal you specified requires a project to execute but there is no POM in this directory (C:\bamboo\xml-data\build-dir\HPPC-SOFTWARE-HPJ10). Please verify you invoked Maven from the correct directory. -> [Help 1]
29-Jul-2020 13:38:59 [ERROR]
29-Jul-2020 13:38:59 [ERROR] To see the full stack trace of the errors, re-run Maven with the -e switch.
29-Jul-2020 13:38:59 [ERROR] Re-run Maven using the -X switch to enable full debug logging.
29-Jul-2020 13:38:59 [ERROR]
29-Jul-2020 13:38:59 [ERROR] For more information about the errors and possible solutions, please read the following articles:
29-Jul-2020 13:38:59 [ERROR] [Help 1] http://cwiki.apache.org/confluence/display/MAVEN/MissingProjectException