Build #118

Build: #118 failed Manual run by Dawid Weiss

Stages & jobs

  1. Compile and test

  2. Package

Logs

The following logs have been generated by the jobs in this plan.
  • Expand all
  • Collapse all
Job Logs
Collapse JDK 11 Compile and test Download or View
17-May-2018 14:25:42 [ERROR] urls[13] = file:/var/atlassian/application-data/bamboo/.m2/AGENT-131073/repository/commons-lang/commons-lang/2.3/commons-lang-2.3.jar
17-May-2018 14:25:42 [ERROR] urls[14] = file:/var/atlassian/application-data/bamboo/.m2/AGENT-131073/repository/org/apache/maven/enforcer/enforcer-api/1.4/enforcer-api-1.4.jar
17-May-2018 14:25:42 [ERROR] urls[15] = file:/var/atlassian/application-data/bamboo/.m2/AGENT-131073/repository/org/apache/maven/enforcer/enforcer-rules/1.4/enforcer-rules-1.4.jar
17-May-2018 14:25:42 [ERROR] urls[16] = file:/var/atlassian/application-data/bamboo/.m2/AGENT-131073/repository/org/apache/maven/shared/maven-common-artifact-filters/1.4/maven-common-artifact-filters-1.4.jar
17-May-2018 14:25:42 [ERROR] urls[17] = file:/var/atlassian/application-data/bamboo/.m2/AGENT-131073/repository/org/beanshell/bsh/2.0b4/bsh-2.0b4.jar
17-May-2018 14:25:42 [ERROR] urls[18] = file:/var/atlassian/application-data/bamboo/.m2/AGENT-131073/repository/org/apache/maven/shared/maven-dependency-tree/2.2/maven-dependency-tree-2.2.jar
17-May-2018 14:25:42 [ERROR] urls[19] = file:/var/atlassian/application-data/bamboo/.m2/AGENT-131073/repository/org/codehaus/plexus/plexus-component-annotations/1.5.5/plexus-component-annotations-1.5.5.jar
17-May-2018 14:25:42 [ERROR] urls[20] = file:/var/atlassian/application-data/bamboo/.m2/AGENT-131073/repository/org/eclipse/aether/aether-util/0.9.0.M2/aether-util-0.9.0.M2.jar
17-May-2018 14:25:42 [ERROR] urls[21] = file:/var/atlassian/application-data/bamboo/.m2/AGENT-131073/repository/org/codehaus/plexus/plexus-i18n/1.0-beta-6/plexus-i18n-1.0-beta-6.jar
17-May-2018 14:25:42 [ERROR] urls[22] = file:/var/atlassian/application-data/bamboo/.m2/AGENT-131073/repository/org/apache/maven/plugin-testing/maven-plugin-testing-harness/1.3/maven-plugin-testing-harness-1.3.jar
17-May-2018 14:25:42 [ERROR] urls[23] = file:/var/atlassian/application-data/bamboo/.m2/AGENT-131073/repository/org/codehaus/plexus/plexus-archiver/2.2/plexus-archiver-2.2.jar
17-May-2018 14:25:42 [ERROR] urls[24] = file:/var/atlassian/application-data/bamboo/.m2/AGENT-131073/repository/org/codehaus/plexus/plexus-io/2.0.4/plexus-io-2.0.4.jar
17-May-2018 14:25:42 [ERROR] urls[25] = file:/var/atlassian/application-data/bamboo/.m2/AGENT-131073/repository/junit/junit/4.11/junit-4.11.jar
17-May-2018 14:25:42 [ERROR] urls[26] = file:/var/atlassian/application-data/bamboo/.m2/AGENT-131073/repository/org/hamcrest/hamcrest-core/1.3/hamcrest-core-1.3.jar
17-May-2018 14:25:42 [ERROR] Number of foreign imports: 1
17-May-2018 14:25:42 [ERROR] import: Entry[import  from realm ClassRealm[project>com.carrotsearch:hppc-parent:0.8.0-SNAPSHOT, parent: ClassRealm[maven.api, parent: null]]]
17-May-2018 14:25:42 [ERROR]
17-May-2018 14:25:42 [ERROR] -----------------------------------------------------: begin 0, end 3, length 2
17-May-2018 14:25:42 [ERROR] -> [Help 1]
17-May-2018 14:25:42 [ERROR]
17-May-2018 14:25:42 [ERROR] To see the full stack trace of the errors, re-run Maven with the -e switch.
17-May-2018 14:25:42 [ERROR] Re-run Maven using the -X switch to enable full debug logging.
17-May-2018 14:25:42 [ERROR]
17-May-2018 14:25:42 [ERROR] For more information about the errors and possible solutions, please read the following articles:
17-May-2018 14:25:42 [ERROR] [Help 1] http://cwiki.apache.org/confluence/display/MAVEN/PluginContainerException