Build #8

Build: #8 failed

Job: JDK 1.8 failed

Build log

The build generated 663 lines of output. Download or view full build log

06-Feb-2014 10:54:46 Build Carrot2 - Software - bugfix-3.8.x - JDK 1.8 #8 (C2-SOFTWARE0-JDK18-8) started building on agent WINDEX 1
06-Feb-2014 10:54:46 Build working directory is E:\xml-data\build-dir\C2-SOFTWARE0-JDK18
06-Feb-2014 10:54:46 Executing build Carrot2 - Software - bugfix-3.8.x - JDK 1.8 #8 (C2-SOFTWARE0-JDK18-8)
06-Feb-2014 10:54:46 Starting task 'Checkout Default Repository' of type 'com.atlassian.bamboo.plugins.vcs:task.vcs.checkout'
06-Feb-2014 10:54:46 Updating source code to revision: c3d3723608eb29b97dbbc4a232193b4f1bfb132d
06-Feb-2014 10:54:47 Fetching 'refs/heads/bugfix/3.8.x' from 'https://github.com/carrot2/carrot2.git'. Will try to do a shallow fetch.
06-Feb-2014 10:54:48 Checking out revision c3d3723608eb29b97dbbc4a232193b4f1bfb132d.
06-Feb-2014 10:54:48 Already on 'bugfix/3.8.x'
06-Feb-2014 10:54:48 Updated source code to revision: c3d3723608eb29b97dbbc4a232193b4f1bfb132d
06-Feb-2014 10:54:48 Finished task 'Checkout Default Repository'
06-Feb-2014 10:54:48 Running pre-build action: VCS Version Collector
06-Feb-2014 10:54:48 Running pre-build action: Clover Grails PreBuild Action
06-Feb-2014 10:54:49 Starting task 'Ant' of type 'com.atlassian.bamboo.plugins.ant:task.builder.ant'
06-Feb-2014 10:54:49
Beginning to execute external process for build 'Carrot2 - Software - bugfix-3.8.x - JDK 1.8 #8 (C2-SOFTWARE0-JDK18-8)'
... running command line:
d:\bamboo\tools\apache-ant-1.8.2\bin\ant.bat -Djava.io.tmpdir=e:\bamboo-home-1\temp\C2-SOFTWARE0-JDK18 clean test
... in: E:\xml-data\build-dir\C2-SOFTWARE0-JDK18
... using extra environment variables:
bamboo_carrotsearch_download_staging_path=/srv/vhosts/staging-get.carrotsearch.com
bamboo_carrot2_download_host=gamma.carrotsearch.com
bamboo_carrotsearch_download_official_path=~/sites/download.carrotsearch.com
JAVA_HOME=d:\dev\java\jdk\oracle-jdk1.8.0-ea
bamboo_carrotsearch_labs_ssh=carrotse@site5.carrot2.org:~/sites/labs.carrotsearch.com
bamboo_carrotsearch_secure_ssh=seccarro@site5.carrot2.org:~/www
bamboo_carrot2_website_ssh=carrot2o@site5.carrot2.org:~/sites/project.carrot2.org
bamboo_carrotsearch_download_staging_user=bamboo
bamboo_carrot2_download_path=/srv/vhosts/get.carrot2.org
bamboo_carrotsearch_download_official_host=download.carrotsearch.com
bamboo_carrotsearch_download_staging_host=gamma.carrotsearch.com
bamboo_csssprites_download_user=bamboo
bamboo_csssprites_download_path=/srv/vhosts/get.csssprites.org
bamboo_lingo3g_branch=bugfix/1.8.x
ANT_HOME=d:\bamboo\tools\apache-ant-1.8.2
bamboo_carrot2_download_user=bamboo
bamboo_carrotsearch_website_ssh=carrotse@site5.carrot2.org:~/sites/www.carrotsearch.com
bamboo_dist_suffix=
bamboo_carrotsearch_download_official_user=carrotse
bamboo_csssprites_download_host=gamma.carrotsearch.com
Path=d:\dev\java\jdk\oracle-jdk1.8.0-ea\bin;C:\Windows\system32;C:\Windows;C:\Windows\System32\Wbem;C:\Windows\System32\WindowsPowerShell\v1.0\;d:\dev\scm\git\cmd;d:\bamboo\tools\apache-ant-1.8.2\bin;d:\bamboo\tools\apache-maven-3.0.4\bin;d:\dev\java\jdk\oracle-jdk1.7.0\bin;d:\tools\bin;d:\dev\scm\git\bin
06-Feb-2014 10:54:49 Buildfile: E:\xml-data\build-dir\C2-SOFTWARE0-JDK18\build.xml
06-Feb-2014 10:54:50 Trying to override old definition of task javac
06-Feb-2014 10:54:50
06-Feb-2014 10:54:50 clover.tasks:
06-Feb-2014 10:54:50
06-Feb-2014 10:54:50 coverage.clean:
06-Feb-2014 10:54:50
06-Feb-2014 10:54:50 clean:
06-Feb-2014 10:54:50    [delete] Deleting directory E:\xml-data\build-dir\C2-SOFTWARE0-JDK18\tmp
06-Feb-2014 10:54:50
06-Feb-2014 10:54:50 compile:
06-Feb-2014 10:54:50     [mkdir] Created dir: E:\xml-data\build-dir\C2-SOFTWARE0-JDK18\tmp\classes
06-Feb-2014 10:54:50     [javac] Compiling 279 source files to E:\xml-data\build-dir\C2-SOFTWARE0-JDK18\tmp\classes
06-Feb-2014 10:54:51     [javac] warning: [options] bootstrap class path not set in conjunction with -source 1.6
06-Feb-2014 10:54:55     [javac] 61 @Bindable metadata processed in round 1 in 1.53 secs.
06-Feb-2014 10:55:06     [javac] Note: Some input files use or override a deprecated API.
06-Feb-2014 10:55:06     [javac] Note: Recompile with -Xlint:deprecation for details.
06-Feb-2014 10:55:06     [javac] Note: E:\xml-data\build-dir\C2-SOFTWARE0-JDK18\core\carrot2-util-xsltfilter\src\org\carrot2\util\xsltfilter\AddHeaderFilter.java uses unchecked or unsafe operations.
06-Feb-2014 10:55:06     [javac] Note: Recompile with -Xlint:unchecked for details.
06-Feb-2014 10:55:06
06-Feb-2014 10:55:06 resources:
06-Feb-2014 10:55:06      [copy] Copying 125 files to E:\xml-data\build-dir\C2-SOFTWARE0-JDK18\tmp\classes
06-Feb-2014 10:55:07
06-Feb-2014 10:55:07 compile.test:
06-Feb-2014 10:55:07     [mkdir] Created dir: E:\xml-data\build-dir\C2-SOFTWARE0-JDK18\tmp\classes-test
06-Feb-2014 10:55:07     [javac] Compiling 179 source files to E:\xml-data\build-dir\C2-SOFTWARE0-JDK18\tmp\classes-test
06-Feb-2014 10:55:07     [javac] warning: [options] bootstrap class path not set in conjunction with -source 1.6
06-Feb-2014 10:55:09     [javac] 34 @Bindable metadata processed in round 1 in 0.66 secs.
06-Feb-2014 10:55:17     [javac] Note: Some input files use or override a deprecated API.
06-Feb-2014 10:55:17     [javac] Note: Recompile with -Xlint:deprecation for details.
06-Feb-2014 10:55:17
06-Feb-2014 10:55:17 clover.tasks:
06-Feb-2014 10:55:17
06-Feb-2014 10:55:17 compile.coverage:
06-Feb-2014 10:55:17
06-Feb-2014 10:55:17 basedir.check:
06-Feb-2014 10:55:17
06-Feb-2014 10:55:17 carrot2.common.basedir.message:
06-Feb-2014 10:55:17
06-Feb-2014 10:55:17 carrot2.dcs.resources.test:
06-Feb-2014 10:55:17      [copy] Copying 2 files to E:\xml-data\build-dir\C2-SOFTWARE0-JDK18\tmp\classes-test
06-Feb-2014 10:55:17
06-Feb-2014 10:55:17 resources.test:
06-Feb-2014 10:55:17      [copy] Copying 32 files to E:\xml-data\build-dir\C2-SOFTWARE0-JDK18\tmp\classes-test
06-Feb-2014 10:55:17
06-Feb-2014 10:55:17 test:
06-Feb-2014 10:55:17     [mkdir] Created dir: E:\xml-data\build-dir\C2-SOFTWARE0-JDK18\tmp\test-report
06-Feb-2014 10:55:17     [mkdir] Created dir: E:\xml-data\build-dir\C2-SOFTWARE0-JDK18\tmp\test-report-jira
06-Feb-2014 10:55:17    [junit4] <JUnit4> says kaixo! Master seed: 9C7BC3FA7D7A81A0
06-Feb-2014 10:55:17    [junit4] Your default console's encoding may not display certain unicode glyphs: windows-1250
06-Feb-2014 10:55:18    [junit4] Executing 97 suites with 4 JVMs.
06-Feb-2014 10:55:18    [junit4]
06-Feb-2014 10:55:20    [junit4] Started J3 PID(8500@WINDEX).
06-Feb-2014 10:55:20    [junit4] Started J0 PID(3068@WINDEX).
06-Feb-2014 10:55:21    [junit4] Started J1 PID(7596@WINDEX).
06-Feb-2014 10:55:21    [junit4] Started J2 PID(10172@WINDEX).
06-Feb-2014 10:55:21    [junit4] Suite: org.carrot2.text.preprocessing.SubstringComparatorTest
06-Feb-2014 10:55:21    [junit4] Completed on J0 in 0.63s, 2 tests
06-Feb-2014 10:55:21    [junit4]
06-Feb-2014 10:55:23    [junit4] Suite: org.carrot2.text.preprocessing.PreprocessedDocumentScannerTest
06-Feb-2014 10:55:23    [junit4] Completed on J3 in 1.84s, 5 tests
06-Feb-2014 10:55:23    [junit4]
06-Feb-2014 10:55:23    [junit4] Suite: org.carrot2.util.ExceptionUtilsTest
06-Feb-2014 10:55:23    [junit4] Completed on J2 in 1.17s, 5 tests
06-Feb-2014 10:55:23    [junit4]
06-Feb-2014 10:55:24    [junit4] Suite: org.carrot2.core.ClusterWithParentTest
06-Feb-2014 10:55:24    [junit4] Completed on J1 in 2.67s, 9 tests
06-Feb-2014 10:55:24    [junit4]
06-Feb-2014 10:55:25    [junit4] Suite: org.carrot2.source.xml.XmlDocumentSourceTest
06-Feb-2014 10:55:25    [junit4] IGNOR/A 0.25s J0 | XmlDocumentSourceTest.testRemoteUrl
06-Feb-2014 10:55:25    [junit4]    > Assumption #1: carrot2.xml.feed.url.base property undefined.
06-Feb-2014 10:55:25    [junit4] Completed on J0 in 3.13s, 13 tests, 1 skipped
06-Feb-2014 10:55:25    [junit4]
06-Feb-2014 10:55:25    [junit4] Suite: org.carrot2.text.preprocessing.filter.MinLengthLabelFilterTest
06-Feb-2014 10:55:25    [junit4] Completed on J2 in 2.02s, 4 tests
06-Feb-2014 10:55:25    [junit4]
06-Feb-2014 10:55:25    [junit4] Suite: org.carrot2.text.preprocessing.filter.StopLabelFilterEnglishTest
06-Feb-2014 10:55:25    [junit4] Completed on J0 in 0.81s, 4 tests
06-Feb-2014 10:55:25    [junit4]
06-Feb-2014 10:55:25    [junit4] Suite: org.carrot2.core.ClusterTest
06-Feb-2014 10:55:25    [junit4] Completed on J2 in 0.30s, 21 tests
06-Feb-2014 10:55:25    [junit4]
06-Feb-2014 10:55:26    [junit4] Suite: org.carrot2.clustering.lingo.ClusterDocumentAssignerTest
06-Feb-2014 10:55:26    [junit4] Completed on J0 in 0.23s, 4 tests
06-Feb-2014 10:55:26    [junit4]
06-Feb-2014 10:55:26    [junit4] Suite: org.carrot2.source.ambient.Odp239DocumentSourceTest
06-Feb-2014 10:55:26    [junit4] Completed on J3 in 3.19s, 6 tests
06-Feb-2014 10:55:26    [junit4]
06-Feb-2014 10:55:26    [junit4] Suite: org.carrot2.text.linguistic.ArabicTest
06-Feb-2014 10:55:26    [junit4] Completed on J0 in 0.33s, 4 tests
06-Feb-2014 10:55:26    [junit4]
06-Feb-2014 10:55:26    [junit4] Suite: org.carrot2.source.SearchRangeTest
06-Feb-2014 10:55:26    [junit4] Completed on J2 in 0.37s, 12 tests
06-Feb-2014 10:55:26    [junit4]
06-Feb-2014 10:55:26    [junit4] Suite: org.carrot2.text.preprocessing.filter.NumericLabelFilterTest
06-Feb-2014 10:55:26    [junit4] Completed on J2 in 0.08s, 5 tests
06-Feb-2014 10:55:26    [junit4]
06-Feb-2014 10:55:26    [junit4] Suite: org.carrot2.text.preprocessing.filter.CompleteLabelFilterTest
06-Feb-2014 10:55:26    [junit4] Completed on J3 in 0.16s, 7 tests
06-Feb-2014 10:55:26    [junit4]
06-Feb-2014 10:55:26    [junit4] Suite: org.carrot2.text.linguistic.EnglishTest
06-Feb-2014 10:55:26    [junit4] Completed on J1 in 1.76s, 5 tests
06-Feb-2014 10:55:26    [junit4]
06-Feb-2014 10:55:26    [junit4] Suite: org.carrot2.clustering.synthetic.ByUrlClusteringAlgorithmTest
06-Feb-2014 10:55:26    [junit4] IGNOR/A 0.00s J0 | ByUrlClusteringAlgorithmTest.testStress
06-Feb-2014 10:55:26    [junit4]    > Assumption #1: 'nightly' test group is disabled (@Nightly)
06-Feb-2014 10:55:26    [junit4] Completed on J0 in 0.22s, 11 tests, 1 skipped
06-Feb-2014 10:55:26    [junit4]
06-Feb-2014 10:55:26    [junit4] Suite: org.carrot2.webapp.filter.QueryWordHighlighterTest
06-Feb-2014 10:55:26    [junit4] Completed on J2 in 0.36s, 12 tests
06-Feb-2014 10:55:26    [junit4]
06-Feb-2014 10:55:26    [junit4] Suite: org.carrot2.clustering.lingo.ClusterMergerTest
06-Feb-2014 10:55:26    [junit4] Completed on J3 in 0.30s, 4 tests
06-Feb-2014 10:55:26    [junit4]
06-Feb-2014 10:55:27    [junit4] Suite: org.carrot2.source.microsoft.Bing3ImageDocumentSourceTest
06-Feb-2014 10:55:27    [junit4] IGNOR/A 0.05s J2 | Bing3ImageDocumentSourceTest.testCatsQuery
06-Feb-2014 10:55:27    [junit4]    > Assumption #1: 'usesexternalservices' test group is disabled (@UsesExternalServices)
06-Feb-2014 10:55:27    [junit4] IGNOR/A 0.00s J2 | Bing3ImageDocumentSourceTest.testMetadataAvailable
06-Feb-2014 10:55:27    [junit4]    > Assumption #1: 'usesexternalservices' test group is disabled (@UsesExternalServices)
06-Feb-2014 10:55:27    [junit4] Completed on J2 in 0.09s, 2 tests, 2 skipped
06-Feb-2014 10:55:27    [junit4]
06-Feb-2014 10:55:27    [junit4] Suite: org.carrot2.source.etools.EToolsDocumentSourceTest
06-Feb-2014 10:55:27    [junit4] IGNOR/A 0.57s J3 | EToolsDocumentSourceTest.testGzipCompression
06-Feb-2014 10:55:27    [junit4]    > Assumption #1: 'usesexternalservices' test group is disabled (@UsesExternalServices)
06-Feb-2014 10:55:27    [junit4] IGNOR/A 0.13s J3 | EToolsDocumentSourceTest.testSmallQuery
06-Feb-2014 10:55:27    [junit4]    > Assumption #1: 'usesexternalservices' test group is disabled (@UsesExternalServices)
06-Feb-2014 10:55:27    [junit4] IGNOR/A 0.02s J3 | EToolsDocumentSourceTest.testResultsTotal
06-Feb-2014 10:55:27    [junit4]    > Assumption #1: 'usesexternalservices' test group is disabled (@UsesExternalServices)
06-Feb-2014 10:55:27    [junit4] IGNOR/A 0.00s J3 | EToolsDocumentSourceTest.testLargeQuery
06-Feb-2014 10:55:27    [junit4]    > Assumption #1: 'usesexternalservices' test group is disabled (@UsesExternalServices)
06-Feb-2014 10:55:27    [junit4] IGNOR/A 0.00s J3 | EToolsDocumentSourceTest.testNoResultsQuery
06-Feb-2014 10:55:27    [junit4]    > Assumption #1: 'usesexternalservices' test group is disabled (@UsesExternalServices)
06-Feb-2014 10:55:27    [junit4] IGNOR/A 0.00s J3 | EToolsDocumentSourceTest.testUtfCharacters
06-Feb-2014 10:55:27    [junit4]    > Assumption #1: 'usesexternalservices' test group is disabled (@UsesExternalServices)
06-Feb-2014 10:55:27    [junit4] IGNOR/A 0.00s J3 | EToolsDocumentSourceTest.testHtmlUnescaping
06-Feb-2014 10:55:27    [junit4]    > Assumption #1: 'usesexternalservices' test group is disabled (@UsesExternalServices)
06-Feb-2014 10:55:27    [junit4] IGNOR/A 0.00s J3 | EToolsDocumentSourceTest.testMetadataAvailable
06-Feb-2014 10:55:27    [junit4]    > Assumption #1: 'usesexternalservices' test group is disabled (@UsesExternalServices)
06-Feb-2014 10:55:27    [junit4] IGNOR/A 0.00s J3 | EToolsDocumentSourceTest.testURLsUnique
06-Feb-2014 10:55:27    [junit4]    > Assumption #1: 'usesexternalservices' test group is disabled (@UsesExternalServices)
06-Feb-2014 10:55:27    [junit4] IGNOR/A 0.02s J3 | EToolsDocumentSourceTest.testInCachingController
06-Feb-2014 10:55:27    [junit4]    > Assumption #1: 'usesexternalservices' test group is disabled (@UsesExternalServices)
06-Feb-2014 10:55:27    [junit4] IGNOR/A 0.00s J3 | EToolsDocumentSourceTest.testDataSources
06-Feb-2014 10:55:27    [junit4]    > Assumption #1: 'usesexternalservices' test group is disabled (@UsesExternalServices)
06-Feb-2014 10:55:27    [junit4] IGNOR/A 0.00s J3 | EToolsDocumentSourceTest.testDataSourceResultsCount
06-Feb-2014 10:55:27    [junit4]    > Assumption #1: 'usesexternalservices' test group is disabled (@UsesExternalServices)
06-Feb-2014 10:55:27    [junit4] Completed on J3 in 0.84s, 12 tests, 12 skipped
06-Feb-2014 10:55:27    [junit4]
06-Feb-2014 10:55:27    [junit4] Suite: org.carrot2.source.google.GoogleDocumentSourceTest
06-Feb-2014 10:55:27    [junit4] IGNOR/A 0.00s J0 | GoogleDocumentSourceTest.testHtmlUnescaping
06-Feb-2014 10:55:27    [junit4]    > Assumption #1: 'usesexternalservices' test group is disabled (@UsesExternalServices)
06-Feb-2014 10:55:27    [junit4] IGNOR/A 0.00s J0 | GoogleDocumentSourceTest.testUtfCharacters
06-Feb-2014 10:55:27    [junit4]    > Assumption #1: 'usesexternalservices' test group is disabled (@UsesExternalServices)
06-Feb-2014 10:55:27    [junit4] IGNOR/A 0.00s J0 | GoogleDocumentSourceTest.testSmallQuery
06-Feb-2014 10:55:27    [junit4]    > Assumption #1: 'usesexternalservices' test group is disabled (@UsesExternalServices)
06-Feb-2014 10:55:27    [junit4] IGNOR/A 0.02s J0 | GoogleDocumentSourceTest.testHighlightsRemoved
06-Feb-2014 10:55:27    [junit4]    > Assumption #1: 'usesexternalservices' test group is disabled (@UsesExternalServices)
06-Feb-2014 10:55:27    [junit4] IGNOR/A 0.05s J0 | GoogleDocumentSourceTest.testLargeQuery
06-Feb-2014 10:55:27    [junit4]    > Assumption #1: 'usesexternalservices' test group is disabled (@UsesExternalServices)
06-Feb-2014 10:55:27    [junit4] IGNOR/A 0.00s J0 | GoogleDocumentSourceTest.testInCachingController
06-Feb-2014 10:55:27    [junit4]    > Assumption #1: 'usesexternalservices' test group is disabled (@UsesExternalServices)
06-Feb-2014 10:55:27    [junit4] IGNOR/A 0.02s J0 | GoogleDocumentSourceTest.testNoResultsQuery
06-Feb-2014 10:55:27    [junit4]    > Assumption #1: 'usesexternalservices' test group is disabled (@UsesExternalServices)
06-Feb-2014 10:55:27    [junit4] IGNOR/A 0.00s J0 | GoogleDocumentSourceTest.testNoUrlEncodingInUrls
06-Feb-2014 10:55:27    [junit4]    > Assumption #1: 'usesexternalservices' test group is disabled (@UsesExternalServices)
06-Feb-2014 10:55:27    [junit4] IGNOR/A 0.00s J0 | GoogleDocumentSourceTest.testURLsUnique
06-Feb-2014 10:55:27    [junit4]    > Assumption #1: 'usesexternalservices' test group is disabled (@UsesExternalServices)
06-Feb-2014 10:55:27    [junit4] IGNOR/A 0.02s J0 | GoogleDocumentSourceTest.testConservativeMode
06-Feb-2014 10:55:27    [junit4]    > Assumption #1: 'usesexternalservices' test group is disabled (@UsesExternalServices)
06-Feb-2014 10:55:27    [junit4] IGNOR/A 0.00s J0 | GoogleDocumentSourceTest.testSpeculativeMode
06-Feb-2014 10:55:27    [junit4]    > Assumption #1: 'usesexternalservices' test group is disabled (@UsesExternalServices)
06-Feb-2014 10:55:27    [junit4] IGNOR/A 0.53s J0 | GoogleDocumentSourceTest.testResultsTotal
06-Feb-2014 10:55:27    [junit4]    > Assumption #1: 'usesexternalservices' test group is disabled (@UsesExternalServices)
06-Feb-2014 10:55:27    [junit4] IGNOR/A 0.02s J0 | GoogleDocumentSourceTest.testMetadataAvailable
06-Feb-2014 10:55:27    [junit4]    > Assumption #1: 'usesexternalservices' test group is disabled (@UsesExternalServices)
06-Feb-2014 10:55:27    [junit4] IGNOR/A 0.00s J0 | GoogleDocumentSourceTest.testQueryLargerThanPage
06-Feb-2014 10:55:27    [junit4]    > Assumption #1: 'usesexternalservices' test group is disabled (@UsesExternalServices)
06-Feb-2014 10:55:27    [junit4] Completed on J0 in 0.80s, 14 tests, 14 skipped
06-Feb-2014 10:55:27    [junit4]
06-Feb-2014 10:55:27    [junit4] Suite: org.carrot2.util.RangeUtilsTest
06-Feb-2014 10:55:27    [junit4] Completed on J0 in 0.05s, 10 tests
06-Feb-2014 10:55:27    [junit4]
06-Feb-2014 10:55:27    [junit4] Suite: org.carrot2.text.preprocessing.WordMarkerTest
06-Feb-2014 10:55:27    [junit4] Completed on J0 in 0.08s, 2 tests
06-Feb-2014 10:55:27    [junit4]
06-Feb-2014 10:55:28    [junit4] Suite: org.carrot2.text.preprocessing.StemmerSyntheticTest
06-Feb-2014 10:55:28    [junit4] Completed on J0 in 0.22s, 12 tests
06-Feb-2014 10:55:28    [junit4]
06-Feb-2014 10:55:28    [junit4] Suite: org.carrot2.matrix.factorization.MatrixFactorizationTest
06-Feb-2014 10:55:28    [junit4] Completed on J2 in 1.03s, 6 tests
06-Feb-2014 10:55:28    [junit4]
06-Feb-2014 10:55:28    [junit4] Suite: org.carrot2.util.IndirectSorterTest
06-Feb-2014 10:55:28    [junit4] Completed on J2 in 0.61s, 23 tests
06-Feb-2014 10:55:28    [junit4]
06-Feb-2014 10:55:28    [junit4] Suite: org.carrot2.source.opensearch.OpenSearchDocumentSourceTest
06-Feb-2014 10:55:28    [junit4] Completed on J2 in 0.05s, 5 tests
06-Feb-2014 10:55:28    [junit4]
06-Feb-2014 10:55:29    [junit4] Suite: org.carrot2.text.linguistic.ChineseTokenizerTest
06-Feb-2014 10:55:29    [junit4] Completed on J2 in 1.05s, 5 tests
06-Feb-2014 10:55:29    [junit4]
06-Feb-2014 10:55:30    [junit4] Suite: org.carrot2.text.preprocessing.PhraseExtractorTest
06-Feb-2014 10:55:30    [junit4] Completed on J1 in 3.94s, 21 tests
06-Feb-2014 10:55:30    [junit4]
06-Feb-2014 10:55:31    [junit4] Suite: org.carrot2.clustering.stc.STCClusteringAlgorithmTest
06-Feb-2014 10:55:31    [junit4] IGNOR/A 0.00s J3 | STCClusteringAlgorithmTest.testStress
06-Feb-2014 10:55:31    [junit4]    > Assumption #1: 'nightly' test group is disabled (@Nightly)
06-Feb-2014 10:55:31    [junit4] Completed on J3 in 3.47s, 11 tests, 1 skipped
06-Feb-2014 10:55:31    [junit4]
06-Feb-2014 10:55:31    [junit4] Suite: org.carrot2.webapp.util.UserAgentUtilsTest
06-Feb-2014 10:55:31    [junit4] Completed on J1 in 0.39s, 11 tests
06-Feb-2014 10:55:31    [junit4]
06-Feb-2014 10:55:31    [junit4] Suite: org.carrot2.text.util.MutableCharArrayTest
06-Feb-2014 10:55:31    [junit4] Completed on J1 in 0.11s, 8 tests
06-Feb-2014 10:55:31    [junit4]
06-Feb-2014 10:55:31    [junit4] Suite: org.carrot2.text.suffixtree.SuffixTreeTest
06-Feb-2014 10:55:31    [junit4] Completed on J1 in 0.67s, 9 tests
06-Feb-2014 10:55:31    [junit4]
06-Feb-2014 10:55:32    [junit4] Suite: org.carrot2.util.pool.FixedSizePoolTest
06-Feb-2014 10:55:32    [junit4] Completed on J0 in 4.01s, 7 tests
06-Feb-2014 10:55:32    [junit4]
06-Feb-2014 10:55:32    [junit4] Suite: org.carrot2.clustering.synthetic.ByFieldClusteringAlgorithmTest
06-Feb-2014 10:55:32    [junit4] IGNOR/A 0.12s J1 | ByFieldClusteringAlgorithmTest.testStress
06-Feb-2014 10:55:32    [junit4]    > Assumption #1: 'nightly' test group is disabled (@Nightly)
06-Feb-2014 10:55:32    [junit4] Completed on J1 in 0.37s, 8 tests, 1 skipped
06-Feb-2014 10:55:32    [junit4]
06-Feb-2014 10:55:32    [junit4] Suite: org.carrot2.output.metrics.PrecisionRecallMetricTest
06-Feb-2014 10:55:32    [junit4] Completed on J0 in 0.06s, 11 tests
06-Feb-2014 10:55:32    [junit4]
06-Feb-2014 10:55:33    [junit4] Suite: org.carrot2.util.httpclient.HttpClientFactoryTest
06-Feb-2014 10:55:33    [junit4] Completed on J1 in 1.70s, 1 test
06-Feb-2014 10:55:33    [junit4]
06-Feb-2014 10:55:34    [junit4] Suite: org.carrot2.dcs.DcsAppTest
06-Feb-2014 10:55:34    [junit4] IGNOR/A 0.11s J3 | DcsAppTest.testExternalSource
06-Feb-2014 10:55:34    [junit4]    > Assumption #1: 'usesexternalservices' test group is disabled (@UsesExternalServices)
06-Feb-2014 10:55:34    [junit4] IGNOR/A 0.00s J3 | DcsAppTest.testPostUrlEncodedWithExternalSource
06-Feb-2014 10:55:34    [junit4]    > Assumption #1: 'usesexternalservices' test group is disabled (@UsesExternalServices)
06-Feb-2014 10:55:34    [junit4] IGNOR/A 0.00s J3 | DcsAppTest.testPostUrlEncodedWithC2Stream
06-Feb-2014 10:55:34    [junit4]    > Assumption #1: 'nightly' test group is disabled (@Nightly)
06-Feb-2014 10:55:34    [junit4] IGNOR/A 0.02s J3 | DcsAppTest.testStartPage
06-Feb-2014 10:55:34    [junit4]    > Assumption #1: 'nightly' test group is disabled (@Nightly)
06-Feb-2014 10:55:34    [junit4] IGNOR/A 0.00s J3 | DcsAppTest.testInputPage
06-Feb-2014 10:55:34    [junit4]    > Assumption #1: 'nightly' test group is disabled (@Nightly)
06-Feb-2014 10:55:34    [junit4] IGNOR/A 0.00s J3 | DcsAppTest.testParametersPage
06-Feb-2014 10:55:34    [junit4]    > Assumption #1: 'nightly' test group is disabled (@Nightly)
06-Feb-2014 10:55:34    [junit4] IGNOR/A 0.02s J3 | DcsAppTest.testFileUpload
06-Feb-2014 10:55:34    [junit4]    > Assumption #1: 'nightly' test group is disabled (@Nightly)
06-Feb-2014 10:55:34    [junit4] IGNOR/A 0.00s J3 | DcsAppTest.testJsonOutput
06-Feb-2014 10:55:34    [junit4]    > Assumption #1: 'nightly' test group is disabled (@Nightly)
06-Feb-2014 10:55:34    [junit4] IGNOR/A 0.00s J3 | DcsAppTest.testPostWithVariousC2StreamXmlEncoding
06-Feb-2014 10:55:34    [junit4]    > Assumption #1: 'nightly' test group is disabled (@Nightly)
06-Feb-2014 10:55:34    [junit4] IGNOR/A 0.00s J3 | DcsAppTest.testOnlyClusters
06-Feb-2014 10:55:34    [junit4]    > Assumption #1: 'nightly' test group is disabled (@Nightly)
06-Feb-2014 10:55:34    [junit4] IGNOR/A 0.00s J3 | DcsAppTest.testOutputPage
06-Feb-2014 10:55:34    [junit4]    > Assumption #1: 'nightly' test group is disabled (@Nightly)
06-Feb-2014 10:55:34    [junit4] IGNOR/A 0.02s J3 | DcsAppTest.testGetWithExternalSource
06-Feb-2014 10:55:34    [junit4]    > Assumption #1: 'usesexternalservices' test group is disabled (@UsesExternalServices)
06-Feb-2014 10:55:34    [junit4] IGNOR/A 0.00s J3 | DcsAppTest.testTextarea
06-Feb-2014 10:55:34    [junit4]    > Assumption #1: 'nightly' test group is disabled (@Nightly)
06-Feb-2014 10:55:34    [junit4] IGNOR/A 0.00s J3 | DcsAppTest.directFeedAttributeOverriding
06-Feb-2014 10:55:34    [junit4]    > Assumption #1: 'nightly' test group is disabled (@Nightly)
06-Feb-2014 10:55:34    [junit4] IGNOR/A 0.00s J3 | DcsAppTest.testJsonCallback
06-Feb-2014 10:55:34    [junit4]    > Assumption #1: 'nightly' test group is disabled (@Nightly)
06-Feb-2014 10:55:34    [junit4] Completed on J3 in 3.37s, 16 tests, 16 skipped
06-Feb-2014 10:55:34    [junit4]
06-Feb-2014 10:55:34    [junit4] Suite: org.carrot2.text.util.CharArrayComparatorsTest
06-Feb-2014 10:55:34    [junit4] Completed on J3 in 0.05s, 3 tests
06-Feb-2014 10:55:34    [junit4]
06-Feb-2014 10:55:34    [junit4] Suite: org.carrot2.text.preprocessing.SuffixSorterTest
06-Feb-2014 10:55:34    [junit4] Completed on J3 in 0.24s, 7 tests
06-Feb-2014 10:55:34    [junit4]
06-Feb-2014 10:55:34    [junit4] Suite: org.carrot2.text.preprocessing.CaseNormalizerTest
06-Feb-2014 10:55:34    [junit4] Completed on J3 in 0.11s, 14 tests
06-Feb-2014 10:55:34    [junit4]
06-Feb-2014 10:55:35    [junit4] Suite: org.carrot2.source.lucene.FSDirectoryWrapperTest
06-Feb-2014 10:55:35    [junit4] Completed on J1 in 1.01s, 1 test
06-Feb-2014 10:55:35    [junit4]
06-Feb-2014 10:55:35    [junit4] Suite: org.carrot2.util.attribute.AttributeValueSetsTest
06-Feb-2014 10:55:35    [junit4] Completed on J3 in 0.19s, 16 tests
06-Feb-2014 10:55:35    [junit4]
06-Feb-2014 10:55:35    [junit4] Suite: org.carrot2.source.opensearch.OpenSearchDocumentSourceByResultIncrementTest
06-Feb-2014 10:55:35    [junit4] IGNOR/A 0.00s J1 | OpenSearchDocumentSourceByResultIncrementTest.testNoResultsQuery
06-Feb-2014 10:55:35    [junit4]    > Assumption #1: 'usesexternalservices' test group is disabled (@UsesExternalServices)
06-Feb-2014 10:55:35    [junit4] IGNOR/A 0.01s J1 | OpenSearchDocumentSourceByResultIncrementTest.testInCachingController
06-Feb-2014 10:55:35    [junit4]    > Assumption #1: 'usesexternalservices' test group is disabled (@UsesExternalServices)
06-Feb-2014 10:55:35    [junit4] IGNOR/A 0.01s J1 | OpenSearchDocumentSourceByResultIncrementTest.testUtfCharacters
06-Feb-2014 10:55:35    [junit4]    > Assumption #1: 'usesexternalservices' test group is disabled (@UsesExternalServices)
06-Feb-2014 10:55:35    [junit4] IGNOR/A 0.00s J1 | OpenSearchDocumentSourceByResultIncrementTest.testURLsUnique
06-Feb-2014 10:55:35    [junit4]    > Assumption #1: 'usesexternalservices' test group is disabled (@UsesExternalServices)
06-Feb-2014 10:55:35    [junit4] IGNOR/A 0.00s J1 | OpenSearchDocumentSourceByResultIncrementTest.testLargeQuery
06-Feb-2014 10:55:35    [junit4]    > Assumption #1: 'usesexternalservices' test group is disabled (@UsesExternalServices)
06-Feb-2014 10:55:35    [junit4] IGNOR/A 0.00s J1 | OpenSearchDocumentSourceByResultIncrementTest.testSmallQuery
06-Feb-2014 10:55:35    [junit4]    > Assumption #1: 'usesexternalservices' test group is disabled (@UsesExternalServices)
06-Feb-2014 10:55:35    [junit4] IGNOR/A 0.00s J1 | OpenSearchDocumentSourceByResultIncrementTest.testHtmlUnescaping
06-Feb-2014 10:55:35    [junit4]    > Assumption #1: 'usesexternalservices' test group is disabled (@UsesExternalServices)
06-Feb-2014 10:55:35    [junit4] IGNOR/A 0.00s J1 | OpenSearchDocumentSourceByResultIncrementTest.testResultsTotal
06-Feb-2014 10:55:35    [junit4]    > Assumption #1: 'usesexternalservices' test group is disabled (@UsesExternalServices)
06-Feb-2014 10:55:35    [junit4] Completed on J1 in 0.23s, 9 tests, 8 skipped
06-Feb-2014 10:55:35    [junit4]
06-Feb-2014 10:55:35    [junit4] Suite: org.carrot2.util.StringUtilsTest
06-Feb-2014 10:55:35    [junit4] Completed on J1 in 0.17s, 9 tests
06-Feb-2014 10:55:35    [junit4]
06-Feb-2014 10:55:35    [junit4] Suite: org.carrot2.core.ComponentSuitesTest
06-Feb-2014 10:55:35    [junit4] Completed on J2 in 5.63s, 3 tests
06-Feb-2014 10:55:35    [junit4]
06-Feb-2014 10:55:35    [junit4] Suite: org.carrot2.output.metrics.NormalizedMutualInformationMetricTest
06-Feb-2014 10:55:35    [junit4] Completed on J2 in 0.20s, 11 tests
06-Feb-2014 10:55:35    [junit4]
06-Feb-2014 10:55:36    [junit4] Suite: org.carrot2.text.vsm.PhraseMatrixBuilderTest
06-Feb-2014 10:55:36    [junit4] Completed on J2 in 0.36s, 6 tests
06-Feb-2014 10:55:36    [junit4]
06-Feb-2014 10:55:36    [junit4] Suite: org.carrot2.core.ProcessingResultTest
06-Feb-2014 10:55:36    [junit4] Completed on J3 in 0.63s, 15 tests
06-Feb-2014 10:55:36    [junit4]
06-Feb-2014 10:55:36    [junit4] Suite: org.carrot2.core.ControllerTest
06-Feb-2014 10:55:36    [junit4] IGNOR/A 0.00s J0 | ControllerTest$SimpleControllerCommonTests.testStress
06-Feb-2014 10:55:36    [junit4]    > Assumption #1: 'nightly' test group is disabled (@Nightly)
06-Feb-2014 10:55:36    [junit4] IGNOR/A 0.02s J0 | ControllerTest$SimpleControllerCommonTests.testNormalExecutionTimeMeasurement
06-Feb-2014 10:55:36    [junit4]    > Assumption #1: 'nightly' test group is disabled (@Nightly)
06-Feb-2014 10:55:36    [junit4] IGNOR/A 0.00s J0 | ControllerTest$PoolingControllerCommonTests.testStress
06-Feb-2014 10:55:36    [junit4]    > Assumption #1: 'nightly' test group is disabled (@Nightly)
06-Feb-2014 10:55:36    [junit4] IGNOR/A 0.00s J0 | ControllerTest$PoolingControllerCommonTests.testNormalExecutionTimeMeasurement
06-Feb-2014 10:55:36    [junit4]    > Assumption #1: 'nightly' test group is disabled (@Nightly)
06-Feb-2014 10:55:36    [junit4] IGNOR/A 0.00s J0 | ControllerTest$CachingPoolingControllerCachingOffCommonTests.testStress
06-Feb-2014 10:55:36    [junit4]    > Assumption #1: 'nightly' test group is disabled (@Nightly)
06-Feb-2014 10:55:36    [junit4] IGNOR/A 0.00s J0 | ControllerTest$CachingPoolingControllerCachingOffCommonTests.testNormalExecutionTimeMeasurement
06-Feb-2014 10:55:36    [junit4]    > Assumption #1: 'nightly' test group is disabled (@Nightly)
06-Feb-2014 10:55:36    [junit4] IGNOR/A 0.00s J0 | ControllerTest$CachingPoolingControllerCachingOnCommonTests.testStress
06-Feb-2014 10:55:36    [junit4]    > Assumption #1: 'nightly' test group is disabled (@Nightly)
06-Feb-2014 10:55:36    [junit4] IGNOR/A 0.00s J0 | ControllerTest$CachingPoolingControllerCachingOnCommonTests.testNormalExecutionTimeMeasurement
06-Feb-2014 10:55:36    [junit4]    > Assumption #1: 'nightly' test group is disabled (@Nightly)
06-Feb-2014 10:55:36    [junit4] IGNOR/A 0.00s J0 | ControllerTest$CachingControllerCachingOffCommonTests.testStress
06-Feb-2014 10:55:36    [junit4]    > Assumption #1: 'nightly' test group is disabled (@Nightly)
06-Feb-2014 10:55:36    [junit4] IGNOR/A 0.00s J0 | ControllerTest$CachingControllerCachingOffCommonTests.testNormalExecutionTimeMeasurement
06-Feb-2014 10:55:36    [junit4]    > Assumption #1: 'nightly' test group is disabled (@Nightly)
06-Feb-2014 10:55:36    [junit4] IGNOR/A 0.02s J0 | ControllerTest$CachingControllerCachingOnCommonTests.testStress
06-Feb-2014 10:55:36    [junit4]    > Assumption #1: 'nightly' test group is disabled (@Nightly)
06-Feb-2014 10:55:36    [junit4] IGNOR/A 0.00s J0 | ControllerTest$CachingControllerCachingOnCommonTests.testNormalExecutionTimeMeasurement
06-Feb-2014 10:55:36    [junit4]    > Assumption #1: 'nightly' test group is disabled (@Nightly)
06-Feb-2014 10:55:36    [junit4] Completed on J0 in 3.93s, 201 tests, 14 skipped
06-Feb-2014 10:55:36    [junit4]
06-Feb-2014 10:55:36    [junit4] Suite: org.carrot2.text.preprocessing.DocumentAssignerTest
06-Feb-2014 10:55:36    [junit4] Completed on J0 in 0.22s, 8 tests
06-Feb-2014 10:55:36    [junit4]
06-Feb-2014 10:55:36    [junit4] Suite: org.carrot2.source.microsoft.Bing3WebDocumentSourceTest
06-Feb-2014 10:55:36    [junit4] IGNOR/A 0.02s J0 | Bing3WebDocumentSourceTest.testQueryLargerThanPage
06-Feb-2014 10:55:36    [junit4]    > Assumption #1: 'usesexternalservices' test group is disabled (@UsesExternalServices)
06-Feb-2014 10:55:36    [junit4] IGNOR/A 0.00s J0 | Bing3WebDocumentSourceTest.testDocFileType
06-Feb-2014 10:55:36    [junit4]    > Assumption #1: 'usesexternalservices' test group is disabled (@UsesExternalServices)
06-Feb-2014 10:55:36    [junit4] IGNOR/A 0.00s J0 | Bing3WebDocumentSourceTest.testUtfCharacters
06-Feb-2014 10:55:36    [junit4]    > Assumption #1: 'usesexternalservices' test group is disabled (@UsesExternalServices)
06-Feb-2014 10:55:36    [junit4] IGNOR/A 0.00s J0 | Bing3WebDocumentSourceTest.testPdfFileType
06-Feb-2014 10:55:36    [junit4]    > Assumption #1: 'usesexternalservices' test group is disabled (@UsesExternalServices)
06-Feb-2014 10:55:36    [junit4] IGNOR/A 0.02s J0 | Bing3WebDocumentSourceTest.testConservativeMode
06-Feb-2014 10:55:36    [junit4]    > Assumption #1: 'usesexternalservices' test group is disabled (@UsesExternalServices)
06-Feb-2014 10:55:36    [junit4] IGNOR/A 0.00s J0 | Bing3WebDocumentSourceTest.testInCachingController
06-Feb-2014 10:55:36    [junit4]    > Assumption #1: 'usesexternalservices' test group is disabled (@UsesExternalServices)
06-Feb-2014 10:55:36    [junit4] IGNOR/A 0.00s J0 | Bing3WebDocumentSourceTest.testURLsUnique
06-Feb-2014 10:55:36    [junit4]    > Assumption #1: 'usesexternalservices' test group is disabled (@UsesExternalServices)
06-Feb-2014 10:55:36    [junit4] IGNOR/A 0.00s J0 | Bing3WebDocumentSourceTest.testSpeculativeMode
06-Feb-2014 10:55:36    [junit4]    > Assumption #1: 'usesexternalservices' test group is disabled (@UsesExternalServices)
06-Feb-2014 10:55:36    [junit4] IGNOR/A 0.00s J0 | Bing3WebDocumentSourceTest.testNoResultsQuery
06-Feb-2014 10:55:36    [junit4]    > Assumption #1: 'usesexternalservices' test group is disabled (@UsesExternalServices)
06-Feb-2014 10:55:36    [junit4] IGNOR/A 0.00s J0 | Bing3WebDocumentSourceTest.testMarketOption
06-Feb-2014 10:55:36    [junit4]    > Assumption #1: 'usesexternalservices' test group is disabled (@UsesExternalServices)
06-Feb-2014 10:55:36    [junit4] IGNOR/A 0.00s J0 | Bing3WebDocumentSourceTest.testResultsTotal
06-Feb-2014 10:55:36    [junit4]    > Assumption #1: 'usesexternalservices' test group is disabled (@UsesExternalServices)
06-Feb-2014 10:55:36    [junit4] IGNOR/A 0.00s J0 | Bing3WebDocumentSourceTest.testSmallQuery
06-Feb-2014 10:55:36    [junit4]    > Assumption #1: 'usesexternalservices' test group is disabled (@UsesExternalServices)
06-Feb-2014 10:55:36    [junit4] IGNOR/A 0.00s J0 | Bing3WebDocumentSourceTest.testHtmlUnescaping
06-Feb-2014 10:55:36    [junit4]    > Assumption #1: 'usesexternalservices' test group is disabled (@UsesExternalServices)
06-Feb-2014 10:55:36    [junit4] IGNOR/A 0.02s J0 | Bing3WebDocumentSourceTest.testSiteOption
06-Feb-2014 10:55:36    [junit4]    > Assumption #1: 'usesexternalservices' test group is disabled (@UsesExternalServices)
06-Feb-2014 10:55:36    [junit4] IGNOR/A 0.00s J0 | Bing3WebDocumentSourceTest.testMetadataAvailable
06-Feb-2014 10:55:36    [junit4]    > Assumption #1: 'usesexternalservices' test group is disabled (@UsesExternalServices)
06-Feb-2014 10:55:36    [junit4] IGNOR/A 0.00s J0 | Bing3WebDocumentSourceTest.testLargeQuery
06-Feb-2014 10:55:36    [junit4]    > Assumption #1: 'usesexternalservices' test group is disabled (@UsesExternalServices)
06-Feb-2014 10:55:36    [junit4] Completed on J0 in 0.07s, 16 tests, 16 skipped
06-Feb-2014 10:55:36    [junit4]
06-Feb-2014 10:55:36    [junit4] Suite: org.carrot2.text.linguistic.DefaultLexicalDataFactoryTest
06-Feb-2014 10:55:36    [junit4] Completed on J2 in 0.68s, 3 tests
06-Feb-2014 10:55:36    [junit4]
06-Feb-2014 10:55:36    [junit4] Suite: org.carrot2.text.util.MutableCharArrayUtilsTest
06-Feb-2014 10:55:36    [junit4] Completed on J2 in 0.20s, 2 tests
06-Feb-2014 10:55:36    [junit4]
06-Feb-2014 10:55:36    [junit4] Suite: org.carrot2.text.linguistic.DefaultStemmerFactoryTest
06-Feb-2014 10:55:36    [junit4] Completed on J1 in 1.13s, 2 tests
06-Feb-2014 10:55:36    [junit4]
06-Feb-2014 10:55:36    [junit4] Suite: org.carrot2.text.linguistic.ExtendedWhitespaceTokenizerTest
06-Feb-2014 10:55:36    [junit4] Completed on J1 in 0.08s, 9 tests
06-Feb-2014 10:55:36    [junit4]
06-Feb-2014 10:55:36    [junit4] Suite: org.carrot2.core.DocumentTest
06-Feb-2014 10:55:36    [junit4] Completed on J3 in 0.70s, 3 tests
06-Feb-2014 10:55:36    [junit4]
06-Feb-2014 10:55:37    [junit4] Suite: org.carrot2.text.linguistic.PolishTest
06-Feb-2014 10:55:37    [junit4] Completed on J3 in 0.89s, 4 tests
06-Feb-2014 10:55:37    [junit4]
06-Feb-2014 10:55:37    [junit4] Suite: org.carrot2.text.linguistic.DefaultTokenizerFactoryTest
06-Feb-2014 10:55:37    [junit4] Completed on J1 in 0.94s, 1 test
06-Feb-2014 10:55:37    [junit4]
06-Feb-2014 10:55:37    [junit4] Suite: org.carrot2.text.vsm.TermDocumentMatrixBuilderTest
06-Feb-2014 10:55:37    [junit4] Completed on J0 in 0.97s, 8 tests
06-Feb-2014 10:55:37    [junit4]
06-Feb-2014 10:55:37    [junit4] Suite: org.carrot2.util.RollingWindowAverageTest
06-Feb-2014 10:55:37    [junit4] Completed on J0 in 0.02s, 3 tests
06-Feb-2014 10:55:37    [junit4]
06-Feb-2014 10:55:37    [junit4] Suite: org.carrot2.output.metrics.ContaminationMetricTest
06-Feb-2014 10:55:37    [junit4] Completed on J3 in 0.22s, 12 tests
06-Feb-2014 10:55:37    [junit4]
06-Feb-2014 10:55:37    [junit4] Suite: org.carrot2.text.preprocessing.filter.StopWordLabelFilterSyntheticTest
06-Feb-2014 10:55:37    [junit4] Completed on J3 in 0.10s, 7 tests
06-Feb-2014 10:55:37    [junit4]
06-Feb-2014 10:55:37    [junit4] Suite: org.carrot2.util.LinearApproximationTest
06-Feb-2014 10:55:37    [junit4] Completed on J1 in 0.02s, 3 tests
06-Feb-2014 10:55:37    [junit4]
06-Feb-2014 10:55:37    [junit4] Suite: org.carrot2.util.resource.ServletContextLocatorTest
06-Feb-2014 10:55:37    [junit4] Completed on J0 in 0.16s, 1 test
06-Feb-2014 10:55:37    [junit4]
06-Feb-2014 10:55:38    [junit4] Suite: org.carrot2.util.CharArrayUtilsTest
06-Feb-2014 10:55:38    [junit4] Completed on J3 in 0.08s, 7 tests, 2 skipped
06-Feb-2014 10:55:38    [junit4]
06-Feb-2014 10:55:38    [junit4] Suite: org.carrot2.webapp.source.WebDocumentSourceTest
06-Feb-2014 10:55:38    [junit4] IGNOR/A 0.00s J3 | WebDocumentSourceTest.testLargeQuery
06-Feb-2014 10:55:38    [junit4]    > Assumption #1: 'usesexternalservices' test group is disabled (@UsesExternalServices)
06-Feb-2014 10:55:38    [junit4] IGNOR/A 0.00s J3 | WebDocumentSourceTest.testURLsUnique
06-Feb-2014 10:55:38    [junit4]    > Assumption #1: 'usesexternalservices' test group is disabled (@UsesExternalServices)
06-Feb-2014 10:55:38    [junit4] IGNOR/A 0.00s J3 | WebDocumentSourceTest.testInCachingController
06-Feb-2014 10:55:38    [junit4]    > Assumption #1: 'usesexternalservices' test group is disabled (@UsesExternalServices)
06-Feb-2014 10:55:38    [junit4] IGNOR/A 0.00s J3 | WebDocumentSourceTest.testResultsTotal
06-Feb-2014 10:55:38    [junit4]    > Assumption #1: 'usesexternalservices' test group is disabled (@UsesExternalServices)
06-Feb-2014 10:55:38    [junit4] IGNOR/A 0.00s J3 | WebDocumentSourceTest.testHtmlUnescaping
06-Feb-2014 10:55:38    [junit4]    > Assumption #1: 'usesexternalservices' test group is disabled (@UsesExternalServices)
06-Feb-2014 10:55:38    [junit4] IGNOR/A 0.00s J3 | WebDocumentSourceTest.testRequestIndependence
06-Feb-2014 10:55:38    [junit4]    > Assumption #1: 'usesexternalservices' test group is disabled (@UsesExternalServices)
06-Feb-2014 10:55:38    [junit4] IGNOR/A 0.00s J3 | WebDocumentSourceTest.testSmallQuery
06-Feb-2014 10:55:38    [junit4]    > Assumption #1: 'usesexternalservices' test group is disabled (@UsesExternalServices)
06-Feb-2014 10:55:38    [junit4] IGNOR/A 0.00s J3 | WebDocumentSourceTest.testNoResultsQuery
06-Feb-2014 10:55:38    [junit4]    > Assumption #1: 'usesexternalservices' test group is disabled (@UsesExternalServices)
06-Feb-2014 10:55:38    [junit4] IGNOR/A 0.00s J3 | WebDocumentSourceTest.testFirstResults
06-Feb-2014 10:55:38    [junit4]    > Assumption #1: 'usesexternalservices' test group is disabled (@UsesExternalServices)
06-Feb-2014 10:55:38    [junit4] IGNOR/A 0.00s J3 | WebDocumentSourceTest.testUtfCharacters
06-Feb-2014 10:55:38    [junit4]    > Assumption #1: 'usesexternalservices' test group is disabled (@UsesExternalServices)
06-Feb-2014 10:55:38    [junit4] Completed on J3 in 0.03s, 11 tests, 10 skipped
06-Feb-2014 10:55:38    [junit4]
06-Feb-2014 10:55:38    [junit4] Suite: org.carrot2.clustering.lingo.LingoClusteringAlgorithmTest
06-Feb-2014 10:55:38    [junit4] IGNOR/A 0.02s J0 | LingoClusteringAlgorithmTest.testStress
06-Feb-2014 10:55:38    [junit4]    > Assumption #1: 'nightly' test group is disabled (@Nightly)
06-Feb-2014 10:55:38    [junit4] Completed on J0 in 0.77s, 10 tests, 1 skipped
06-Feb-2014 10:55:38    [junit4]
06-Feb-2014 10:55:38    [junit4] Suite: org.carrot2.source.ambient.AmbientDocumentSourceTest
06-Feb-2014 10:55:38    [junit4] Completed on J3 in 0.54s, 6 tests
06-Feb-2014 10:55:38    [junit4]
06-Feb-2014 10:55:39    [junit4] Suite: org.carrot2.text.preprocessing.StemmerEnglishTest
06-Feb-2014 10:55:39    [junit4] Completed on J3 in 0.14s, 3 tests
06-Feb-2014 10:55:39    [junit4]
06-Feb-2014 10:55:39    [junit4] Suite: org.carrot2.source.lucene.LuceneDocumentSourceTest
06-Feb-2014 10:55:39    [junit4] IGNOR/A 0.00s J2 | LuceneDocumentSourceTest.testNoResultsQuery
06-Feb-2014 10:55:39    [junit4]    > Assumption #1: 'usesexternalservices' test group is disabled (@UsesExternalServices)
06-Feb-2014 10:55:39    [junit4] IGNOR/A 0.00s J2 | LuceneDocumentSourceTest.testInCachingController
06-Feb-2014 10:55:39    [junit4]    > Assumption #1: 'usesexternalservices' test group is disabled (@UsesExternalServices)
06-Feb-2014 10:55:39    [junit4] IGNOR/A 0.00s J2 | LuceneDocumentSourceTest.testUtfCharacters
06-Feb-2014 10:55:39    [junit4]    > Assumption #1: 'usesexternalservices' test group is disabled (@UsesExternalServices)
06-Feb-2014 10:55:39    [junit4] IGNOR/A 0.00s J2 | LuceneDocumentSourceTest.testLargeQuery
06-Feb-2014 10:55:39    [junit4]    > Assumption #1: 'usesexternalservices' test group is disabled (@UsesExternalServices)
06-Feb-2014 10:55:39    [junit4] IGNOR/A 0.02s J2 | LuceneDocumentSourceTest.testResultsTotal
06-Feb-2014 10:55:39    [junit4]    > Assumption #1: 'usesexternalservices' test group is disabled (@UsesExternalServices)
06-Feb-2014 10:55:39    [junit4] IGNOR/A 0.02s J2 | LuceneDocumentSourceTest.testHtmlUnescaping
06-Feb-2014 10:55:39    [junit4]    > Assumption #1: 'usesexternalservices' test group is disabled (@UsesExternalServices)
06-Feb-2014 10:55:39    [junit4] IGNOR/A 0.02s J2 | LuceneDocumentSourceTest.testURLsUnique
06-Feb-2014 10:55:39    [junit4]    > Assumption #1: 'usesexternalservices' test group is disabled (@UsesExternalServices)
06-Feb-2014 10:55:39    [junit4] IGNOR/A 0.00s J2 | LuceneDocumentSourceTest.testSmallQuery
06-Feb-2014 10:55:39    [junit4]    > Assumption #1: 'usesexternalservices' test group is disabled (@UsesExternalServices)
06-Feb-2014 10:55:39    [junit4] Completed on J2 in 2.84s, 19 tests, 8 skipped
06-Feb-2014 10:55:39    [junit4]
06-Feb-2014 10:55:39    [junit4] Suite: org.carrot2.output.metrics.IdealPartitioningBasedMetricTest
06-Feb-2014 10:55:39    [junit4] Completed on J2 in 0.02s, 1 test
06-Feb-2014 10:55:39    [junit4]
06-Feb-2014 10:55:40    [junit4] Suite: org.carrot2.clustering.lingo.ClusterLabelBuilderTest
06-Feb-2014 10:55:40    [junit4] Completed on J3 in 0.58s, 6 tests
06-Feb-2014 10:55:40    [junit4]
06-Feb-2014 10:55:40    [junit4] Suite: org.carrot2.text.linguistic.ThaiTokenizerTest
06-Feb-2014 10:55:40    [junit4] Completed on J2 in 0.13s, 3 tests
06-Feb-2014 10:55:40    [junit4]
06-Feb-2014 10:55:40    [junit4] Suite: org.carrot2.clustering.kmeans.BisectingKMeansClusteringAlgorithmTest
06-Feb-2014 10:55:40    [junit4] IGNOR/A 0.00s J1 | BisectingKMeansClusteringAlgorithmTest.testStress
06-Feb-2014 10:55:40    [junit4]    > Assumption #1: 'nightly' test group is disabled (@Nightly)
06-Feb-2014 10:55:40    [junit4] Completed on J1 in 2.51s, 8 tests, 1 skipped
06-Feb-2014 10:55:40    [junit4]
06-Feb-2014 10:55:40    [junit4] Suite: org.carrot2.text.clustering.MultilingualClusteringTest
06-Feb-2014 10:55:40    [junit4] Completed on J3 in 0.05s, 16 tests
06-Feb-2014 10:55:40    [junit4]
06-Feb-2014 10:55:40    [junit4] Suite: org.carrot2.matrix.MatrixUtilsTest
06-Feb-2014 10:55:40    [junit4] Completed on J2 in 0.06s, 16 tests
06-Feb-2014 10:55:40    [junit4]
06-Feb-2014 10:55:40    [junit4] Suite: org.carrot2.text.linguistic.LanguageModelTest
06-Feb-2014 10:55:40    [junit4] Completed on J1 in 0.05s, 2 tests
06-Feb-2014 10:55:40    [junit4]
06-Feb-2014 10:55:40    [junit4] Suite: org.carrot2.clustering.stc.GeneralizedSuffixTreeTest
06-Feb-2014 10:55:40    [junit4] Completed on J2 in 0.16s, 3 tests
06-Feb-2014 10:55:40    [junit4]
06-Feb-2014 10:55:40    [junit4] Suite: org.carrot2.text.preprocessing.TokenizerTest
06-Feb-2014 10:55:40    [junit4] Completed on J3 in 0.25s, 7 tests
06-Feb-2014 10:55:40    [junit4]
06-Feb-2014 10:55:40    [junit4] Suite: org.carrot2.util.pool.SoftUnboundedPoolTest
06-Feb-2014 10:55:40    [junit4] Completed on J0 in 1.95s, 6 tests
06-Feb-2014 10:55:40    [junit4]
06-Feb-2014 10:55:40    [junit4] Suite: org.carrot2.text.preprocessing.filter.StopWordLabelFilterMergedTest
06-Feb-2014 10:55:40    [junit4] Completed on J1 in 0.42s, 4 tests
06-Feb-2014 10:55:40    [junit4]
06-Feb-2014 10:55:41    [junit4] Suite: org.carrot2.util.resource.ResourceLookupTest
06-Feb-2014 10:55:41    [junit4] Completed on J0 in 0.11s, 6 tests
06-Feb-2014 10:55:41    [junit4]
06-Feb-2014 10:55:41    [junit4] Suite: org.carrot2.text.preprocessing.filter.StopWordLabelFilterEnglishTest
06-Feb-2014 10:55:41    [junit4] Completed on J2 in 0.50s, 4 tests
06-Feb-2014 10:55:41    [junit4]
06-Feb-2014 10:55:41    [junit4] Suite: org.carrot2.source.pubmed.PubMedDocumentSourceTest
06-Feb-2014 10:55:41    [junit4] IGNOR/A 0.00s J3 | PubMedDocumentSourceTest.testNoResultsQuery
06-Feb-2014 10:55:41    [junit4]    > Assumption #1: 'usesexternalservices' test group is disabled (@UsesExternalServices)
06-Feb-2014 10:55:41    [junit4] IGNOR/A 0.00s J3 | PubMedDocumentSourceTest.testInCachingController
06-Feb-2014 10:55:41    [junit4]    > Assumption #1: 'usesexternalservices' test group is disabled (@UsesExternalServices)
06-Feb-2014 10:55:41    [junit4] IGNOR/A 0.00s J3 | PubMedDocumentSourceTest.testUtfCharacters
06-Feb-2014 10:55:41    [junit4]    > Assumption #1: 'usesexternalservices' test group is disabled (@UsesExternalServices)
06-Feb-2014 10:55:41    [junit4] IGNOR/A 0.00s J3 | PubMedDocumentSourceTest.testURLsUnique
06-Feb-2014 10:55:41    [junit4]    > Assumption #1: 'usesexternalservices' test group is disabled (@UsesExternalServices)
06-Feb-2014 10:55:41    [junit4] IGNOR/A 0.00s J3 | PubMedDocumentSourceTest.testLargeQuery
06-Feb-2014 10:55:41    [junit4]    > Assumption #1: 'usesexternalservices' test group is disabled (@UsesExternalServices)
06-Feb-2014 10:55:41    [junit4] IGNOR/A 0.00s J3 | PubMedDocumentSourceTest.testSmallQuery
06-Feb-2014 10:55:41    [junit4]    > Assumption #1: 'usesexternalservices' test group is disabled (@UsesExternalServices)
06-Feb-2014 10:55:41    [junit4] IGNOR/A 0.00s J3 | PubMedDocumentSourceTest.testHtmlUnescaping
06-Feb-2014 10:55:41    [junit4]    > Assumption #1: 'usesexternalservices' test group is disabled (@UsesExternalServices)
06-Feb-2014 10:55:41    [junit4] IGNOR/A 0.00s J3 | PubMedDocumentSourceTest.testResultsTotal
06-Feb-2014 10:55:41    [junit4]    > Assumption #1: 'usesexternalservices' test group is disabled (@UsesExternalServices)
06-Feb-2014 10:55:41    [junit4] Completed on J3 in 0.03s, 9 tests, 8 skipped
06-Feb-2014 10:55:41    [junit4]
06-Feb-2014 10:55:41    [junit4] Suite: org.carrot2.text.preprocessing.LabelFormatterTest
06-Feb-2014 10:55:41    [junit4] Completed on J0 in 0.05s, 8 tests
06-Feb-2014 10:55:41    [junit4]
06-Feb-2014 10:55:41    [junit4] Suite: org.carrot2.util.GraphUtilsTest
06-Feb-2014 10:55:41    [junit4] Completed on J2 in 0.20s, 5 tests
06-Feb-2014 10:55:41    [junit4]
06-Feb-2014 10:55:41    [junit4] Suite: org.carrot2.util.simplexml.SimpleXmlWrappersTest
06-Feb-2014 10:55:41    [junit4] Completed on J1 in 1.19s, 28 tests
06-Feb-2014 10:55:41    [junit4]
06-Feb-2014 10:55:41    [junit4] Suite: org.carrot2.text.preprocessing.filter.QueryLabelFilterTest
06-Feb-2014 10:55:41    [junit4] Completed on J1 in 0.12s, 5 tests
06-Feb-2014 10:55:41    [junit4]
06-Feb-2014 10:55:41    [junit4] Suite: org.carrot2.util.IntArrayPredicateIteratorTest
06-Feb-2014 10:55:41    [junit4] Completed on J3 in 0.52s, 5 tests
06-Feb-2014 10:55:41    [junit4]
06-Feb-2014 10:55:41    [junit4] Suite: org.carrot2.util.resource.URLResourceWithParamsTest
06-Feb-2014 10:55:41    [junit4] Completed on J0 in 0.47s, 2 tests
06-Feb-2014 10:55:41    [junit4]
06-Feb-2014 10:55:42    [junit4] Suite: org.carrot2.text.preprocessing.filter.GenitiveLabelFilterTest
06-Feb-2014 10:55:42    [junit4] Completed on J2 in 0.87s, 5 tests
06-Feb-2014 10:55:42    [junit4]
06-Feb-2014 10:55:42    [junit4] Suite: org.carrot2.source.microsoft.Bing3NewsDocumentSourceTest
06-Feb-2014 10:55:42    [junit4] IGNOR/A 0.00s J3 | Bing3NewsDocumentSourceTest.testNewsCategory
06-Feb-2014 10:55:42    [junit4]    > Assumption #1: 'usesexternalservices' test group is disabled (@UsesExternalServices)
06-Feb-2014 10:55:42    [junit4] IGNOR/A 0.00s J3 | Bing3NewsDocumentSourceTest.testMetadataAvailable
06-Feb-2014 10:55:42    [junit4]    > Assumption #1: 'usesexternalservices' test group is disabled (@UsesExternalServices)
06-Feb-2014 10:55:42    [junit4] IGNOR/A 0.00s J3 | Bing3NewsDocumentSourceTest.testPresidentQuery
06-Feb-2014 10:55:42    [junit4]    > Assumption #1: 'usesexternalservices' test group is disabled (@UsesExternalServices)
06-Feb-2014 10:55:42    [junit4] Completed on J3 in 0.35s, 3 tests, 3 skipped
06-Feb-2014 10:55:42    [junit4]
06-Feb-2014 10:55:42    [junit4] Suite: org.carrot2.util.attribute.AttributeValueSetTest
06-Feb-2014 10:55:42    [junit4] Completed on J1 in 0.45s, 3 tests
06-Feb-2014 10:55:42    [junit4]
06-Feb-2014 10:55:42    [junit4] Suite: org.carrot2.util.attribute.ResourceFromStringTest
06-Feb-2014 10:55:42    [junit4] Completed on J3 in 0.05s, 2 tests
06-Feb-2014 10:55:42    [junit4]
06-Feb-2014 10:55:43    [junit4] Suite: org.carrot2.source.pubmed.PubMedContentHandlerTest
06-Feb-2014 10:55:43    [junit4] Completed on J0 in 1.56s, 1 test
06-Feb-2014 10:55:43    [junit4]
06-Feb-2014 10:56:13    [junit4] Suite: org.carrot2.source.pubmed.PubMedIdSearchHandlerTest
06-Feb-2014 10:56:13    [junit4] ERROR   30.5s J2 | PubMedIdSearchHandlerTest.testIdHandler <<<
06-Feb-2014 10:56:13    [junit4]    > Throwable #1: java.io.IOException: Server returned HTTP response code: 503 for URL: http://www.ncbi.nlm.nih.gov/entrez/query/DTD/eSearch_020511.dtd
06-Feb-2014 10:56:13    [junit4]    >         at __randomizedtesting.SeedInfo.seed([9C7BC3FA7D7A81A0:DF94A2C68DC4B3A6]:0)
06-Feb-2014 10:56:13    [junit4]    >         at sun.net.www.protocol.http.HttpURLConnection.getInputStream0(HttpURLConnection.java:1838)
06-Feb-2014 10:56:13    [junit4]    >         at sun.net.www.protocol.http.HttpURLConnection.getInputStream(HttpURLConnection.java:1439)
06-Feb-2014 10:56:13    [junit4]    >         at org.apache.xerces.impl.XMLEntityManager.setupCurrentEntity(Unknown Source)
06-Feb-2014 10:56:13    [junit4]    >         at org.apache.xerces.impl.XMLEntityManager.startEntity(Unknown Source)
06-Feb-2014 10:56:13    [junit4]    >         at org.apache.xerces.impl.XMLEntityManager.startDTDEntity(Unknown Source)
06-Feb-2014 10:56:13    [junit4]    >         at org.apache.xerces.impl.XMLDTDScannerImpl.setInputSource(Unknown Source)
06-Feb-2014 10:56:13    [junit4]    >         at org.apache.xerces.impl.XMLDocumentScannerImpl$DTDDispatcher.dispatch(Unknown Source)
06-Feb-2014 10:56:13    [junit4]    >         at org.apache.xerces.impl.XMLDocumentFragmentScannerImpl.scanDocument(Unknown Source)
06-Feb-2014 10:56:13    [junit4]    >         at org.apache.xerces.parsers.XML11Configuration.parse(Unknown Source)
06-Feb-2014 10:56:13    [junit4]    >         at org.apache.xerces.parsers.XML11Configuration.parse(Unknown Source)
06-Feb-2014 10:56:13    [junit4]    >         at org.apache.xerces.parsers.XMLParser.parse(Unknown Source)
06-Feb-2014 10:56:13    [junit4]    >         at org.apache.xerces.parsers.AbstractSAXParser.parse(Unknown Source)
06-Feb-2014 10:56:13    [junit4]    >         at org.apache.xerces.jaxp.SAXParserImpl$JAXPSAXParser.parse(Unknown Source)
06-Feb-2014 10:56:13    [junit4]    >         at org.carrot2.source.pubmed.PubMedIdSearchHandlerTest.testIdHandler(PubMedIdSearchHandlerTest.java:182)
06-Feb-2014 10:56:13    [junit4]    >         at sun.reflect.NativeMethodAccessorImpl.invoke0(Native Method)
06-Feb-2014 10:56:13    [junit4]    >         at sun.reflect.NativeMethodAccessorImpl.invoke(NativeMethodAccessorImpl.java:62)
06-Feb-2014 10:56:13    [junit4]    >         at sun.reflect.DelegatingMethodAccessorImpl.invoke(DelegatingMethodAccessorImpl.java:43)
06-Feb-2014 10:56:13    [junit4]    >         at java.lang.reflect.Method.invoke(Method.java:483)
06-Feb-2014 10:56:13    [junit4]    >         at com.carrotsearch.randomizedtesting.RandomizedRunner.invoke(RandomizedRunner.java:1559)
06-Feb-2014 10:56:13    [junit4]    >         at com.carrotsearch.randomizedtesting.RandomizedRunner.access$600(RandomizedRunner.java:79)
06-Feb-2014 10:56:13    [junit4]    >         at com.carrotsearch.randomizedtesting.RandomizedRunner$6.evaluate(RandomizedRunner.java:737)
06-Feb-2014 10:56:13    [junit4]    >         at com.carrotsearch.randomizedtesting.rules.SystemPropertiesInvariantRule$1.evaluate(SystemPropertiesInvariantRule.java:55)
06-Feb-2014 10:56:13    [junit4]    >         at com.carrotsearch.randomizedtesting.rules.StatementAdapter.evaluate(StatementAdapter.java:36)
06-Feb-2014 10:56:13    [junit4]    >         at com.carrotsearch.randomizedtesting.ThreadLeakControl$StatementRunner.run(ThreadLeakControl.java:358)
06-Feb-2014 10:56:13    [junit4]    >         at com.carrotsearch.randomizedtesting.ThreadLeakControl.forkTimeoutingTask(ThreadLeakControl.java:782)
06-Feb-2014 10:56:13    [junit4]    >         at com.carrotsearch.randomizedtesting.ThreadLeakControl$3.evaluate(ThreadLeakControl.java:442)
06-Feb-2014 10:56:13    [junit4]    >         at com.carrotsearch.randomizedtesting.RandomizedRunner.runSingleTest(RandomizedRunner.java:746)
06-Feb-2014 10:56:13    [junit4]    >         at com.carrotsearch.randomizedtesting.RandomizedRunner$3.evaluate(RandomizedRunner.java:648)
06-Feb-2014 10:56:13    [junit4]    >         at com.carrotsearch.randomizedtesting.RandomizedRunner$4.evaluate(RandomizedRunner.java:682)
06-Feb-2014 10:56:13    [junit4]    >         at com.carrotsearch.randomizedtesting.RandomizedRunner$5.evaluate(RandomizedRunner.java:693)
06-Feb-2014 10:56:13    [junit4]    >         at com.carrotsearch.randomizedtesting.rules.NoShadowingOrOverridesOnMethodsRule$1.evaluate(NoShadowingOrOverridesOnMethodsRule.java:39)
06-Feb-2014 10:56:13    [junit4]    >         at com.carrotsearch.randomizedtesting.rules.NoShadowingOrOverridesOnMethodsRule$1.evaluate(NoShadowingOrOverridesOnMethodsRule.java:39)
06-Feb-2014 10:56:13    [junit4]    >         at com.carrotsearch.randomizedtesting.rules.StatementAdapter.evaluate(StatementAdapter.java:36)
06-Feb-2014 10:56:13    [junit4]    >         at com.carrotsearch.randomizedtesting.rules.SystemPropertiesInvariantRule$1.evaluate(SystemPropertiesInvariantRule.java:55)
06-Feb-2014 10:56:13    [junit4]    >         at com.carrotsearch.randomizedtesting.rules.StatementAdapter.evaluate(StatementAdapter.java:36)
06-Feb-2014 10:56:13    [junit4]    >         at com.carrotsearch.randomizedtesting.ThreadLeakControl$StatementRunner.run(ThreadLeakControl.java:358)
06-Feb-2014 10:56:13    [junit4]    >         at java.lang.Thread.run(Thread.java:744)
06-Feb-2014 10:56:13    [junit4] Completed on J2 in 30.60s, 1 test, 1 error <<< FAILURES!
06-Feb-2014 10:56:13    [junit4]
06-Feb-2014 10:56:13    [junit4]
06-Feb-2014 10:56:13    [junit4] Tests with failures:
06-Feb-2014 10:56:13    [junit4]   - org.carrot2.source.pubmed.PubMedIdSearchHandlerTest.testIdHandler
06-Feb-2014 10:56:13    [junit4]
06-Feb-2014 10:56:13    [junit4]
06-Feb-2014 10:56:13
06-Feb-2014 10:56:13 BUILD FAILED
06-Feb-2014 10:56:13 E:\xml-data\build-dir\C2-SOFTWARE0-JDK18\build.xml:531: Tests failed. See E:\xml-data\build-dir\C2-SOFTWARE0-JDK18\tmp\test-report for report.
06-Feb-2014 10:56:13
06-Feb-2014 10:56:13 Total time: 1 minute 24 seconds
06-Feb-2014 10:56:13    [junit4] JVM J0:     2.15 ..    25.82 =    23.66s
06-Feb-2014 10:56:13    [junit4] JVM J1:     3.09 ..    24.35 =    21.26s
06-Feb-2014 10:56:13    [junit4] JVM J2:     3.36 ..    55.39 =    52.03s
06-Feb-2014 10:56:13    [junit4] JVM J3:     2.09 ..    24.86 =    22.77s
06-Feb-2014 10:56:13    [junit4] Execution time total: 55 seconds
06-Feb-2014 10:56:13    [junit4] Tests summary: 97 suites, 919 tests, 1 error, 119 ignored (114 assumptions)
06-Feb-2014 10:56:13 Failing task since return code of [d:\bamboo\tools\apache-ant-1.8.2\bin\ant.bat -Djava.io.tmpdir=e:\bamboo-home-1\temp\C2-SOFTWARE0-JDK18 clean test] was 1 while expected 0
06-Feb-2014 10:56:13 Parsing test results...
06-Feb-2014 10:56:15 Finished task 'Ant'
06-Feb-2014 10:56:15 Running post build plugin 'Artifact Copier'
06-Feb-2014 10:56:15 Running post build plugin 'NCover Results Collector'
06-Feb-2014 10:56:15 Running post build plugin 'Clover Results Collector'
06-Feb-2014 10:56:15 Finalising the build...
06-Feb-2014 10:56:15 Stopping timer.
06-Feb-2014 10:56:15 Build C2-SOFTWARE0-JDK18-8 completed.
06-Feb-2014 10:56:20 Running on server: post build plugin 'NCover Results Collector'
06-Feb-2014 10:56:20 Running on server: post build plugin 'Clover Delta Calculator'
06-Feb-2014 10:56:20 Running on server: post build plugin 'Build Hanging Detection Configuration'
06-Feb-2014 10:56:20 Running on server: post build plugin 'Maven Dependencies Postprocessor'
06-Feb-2014 10:56:20 All post build plugins have finished
06-Feb-2014 10:56:20 Generating build results summary...
06-Feb-2014 10:56:20 Saving build results to disk...
06-Feb-2014 10:56:20 Indexing build results...
06-Feb-2014 10:56:20 Finished building C2-SOFTWARE0-JDK18-8.