Build #8

Build: #8 failed

Job: JDK 1.6 failed

Build log

The build generated 660 lines of output. Download or view full build log

06-Feb-2014 10:54:50 Build Carrot2 - Software - bugfix-3.8.x - JDK 1.6 #8 (C2-SOFTWARE0-JDK16-8) started building on agent Local Agent 2
06-Feb-2014 10:54:50 Build working directory is /mnt/work/bamboo-home/xml-data/build-dir/C2-SOFTWARE0-JDK16
06-Feb-2014 10:54:50 Executing build Carrot2 - Software - bugfix-3.8.x - JDK 1.6 #8 (C2-SOFTWARE0-JDK16-8)
06-Feb-2014 10:54:50 Starting task 'Checkout Default Repository' of type 'com.atlassian.bamboo.plugins.vcs:task.vcs.checkout'
06-Feb-2014 10:54:50 Updating source code to revision: c3d3723608eb29b97dbbc4a232193b4f1bfb132d
06-Feb-2014 10:54:52 Fetching 'refs/heads/bugfix/3.8.x' from 'https://github.com/carrot2/carrot2.git'.
06-Feb-2014 10:54:53 Checking out revision c3d3723608eb29b97dbbc4a232193b4f1bfb132d.
06-Feb-2014 10:54:53 HEAD is now at c3d3723... CARROT-1022: removing references to Gooogle.
06-Feb-2014 10:54:53 Updated source code to revision: c3d3723608eb29b97dbbc4a232193b4f1bfb132d
06-Feb-2014 10:54:53 Finished task 'Checkout Default Repository'
06-Feb-2014 10:54:53 Running pre-build action: Clover Grails PreBuild Action
06-Feb-2014 10:54:53 Running pre-build action: VCS Version Collector
06-Feb-2014 10:54:53 Starting task 'Ant' of type 'com.atlassian.bamboo.plugins.ant:task.builder.ant'
06-Feb-2014 10:54:53
Beginning to execute external process for build 'Carrot2 - Software - bugfix-3.8.x - JDK 1.6 #8 (C2-SOFTWARE0-JDK16-8)'
... running command line:
/usr/share/ant/bin/ant -Djava.io.tmpdir=/home/bamboo/bamboo-software/temp/C2-SOFTWARE0-JDK16 clean test
... in: /mnt/work/bamboo-home/xml-data/build-dir/C2-SOFTWARE0-JDK16
... using extra environment variables:
bamboo_carrotsearch_download_staging_path=/srv/vhosts/staging-get.carrotsearch.com
bamboo_carrot2_download_host=gamma.carrotsearch.com
bamboo_carrotsearch_download_official_path=~/sites/download.carrotsearch.com
JAVA_HOME=/usr/lib/jvm/java-6-openjdk-amd64
bamboo_carrotsearch_labs_ssh=carrotse@site5.carrot2.org:~/sites/labs.carrotsearch.com
bamboo_carrotsearch_secure_ssh=seccarro@site5.carrot2.org:~/www
bamboo_carrot2_website_ssh=carrot2o@site5.carrot2.org:~/sites/project.carrot2.org
bamboo_carrotsearch_download_staging_user=bamboo
bamboo_carrot2_download_path=/srv/vhosts/get.carrot2.org
bamboo_carrotsearch_download_official_host=download.carrotsearch.com
bamboo_carrotsearch_download_staging_host=gamma.carrotsearch.com
bamboo_csssprites_download_user=bamboo
bamboo_csssprites_download_path=/srv/vhosts/get.csssprites.org
bamboo_lingo3g_branch=bugfix/1.8.x
ANT_HOME=/usr/share/ant
bamboo_carrot2_download_user=bamboo
bamboo_carrotsearch_website_ssh=carrotse@site5.carrot2.org:~/sites/www.carrotsearch.com
bamboo_dist_suffix=
bamboo_carrotsearch_download_official_user=carrotse
bamboo_csssprites_download_host=gamma.carrotsearch.com
PATH=/usr/lib/jvm/java-6-openjdk-amd64/bin:/usr/local/bin:/usr/bin:/bin:/usr/local/games:/usr/games
06-Feb-2014 10:54:53 Buildfile: /mnt/work/bamboo-home/xml-data/build-dir/C2-SOFTWARE0-JDK16/build.xml
06-Feb-2014 10:54:54 Trying to override old definition of task javac
06-Feb-2014 10:54:54
06-Feb-2014 10:54:54 clover.tasks:
06-Feb-2014 10:54:54
06-Feb-2014 10:54:54 coverage.clean:
06-Feb-2014 10:54:54
06-Feb-2014 10:54:54 clean:
06-Feb-2014 10:54:54    [delete] Deleting directory /mnt/work/bamboo-home/xml-data/build-dir/C2-SOFTWARE0-JDK16/tmp
06-Feb-2014 10:54:54
06-Feb-2014 10:54:54 compile:
06-Feb-2014 10:54:54     [mkdir] Created dir: /mnt/work/bamboo-home/xml-data/build-dir/C2-SOFTWARE0-JDK16/tmp/classes
06-Feb-2014 10:54:54     [javac] Compiling 279 source files to /mnt/work/bamboo-home/xml-data/build-dir/C2-SOFTWARE0-JDK16/tmp/classes
06-Feb-2014 10:54:58     [javac] 61 @Bindable metadata processed in round 1 in 1.62 secs.
06-Feb-2014 10:55:03     [javac] Note: Some input files use or override a deprecated API.
06-Feb-2014 10:55:03     [javac] Note: Recompile with -Xlint:deprecation for details.
06-Feb-2014 10:55:03     [javac] Note: /mnt/work/bamboo-home/xml-data/build-dir/C2-SOFTWARE0-JDK16/core/carrot2-util-xsltfilter/src/org/carrot2/util/xsltfilter/AddHeaderFilter.java uses unchecked or unsafe operations.
06-Feb-2014 10:55:03     [javac] Note: Recompile with -Xlint:unchecked for details.
06-Feb-2014 10:55:03
06-Feb-2014 10:55:03 resources:
06-Feb-2014 10:55:03      [copy] Copying 125 files to /mnt/work/bamboo-home/xml-data/build-dir/C2-SOFTWARE0-JDK16/tmp/classes
06-Feb-2014 10:55:03
06-Feb-2014 10:55:03 compile.test:
06-Feb-2014 10:55:03     [mkdir] Created dir: /mnt/work/bamboo-home/xml-data/build-dir/C2-SOFTWARE0-JDK16/tmp/classes-test
06-Feb-2014 10:55:03     [javac] Compiling 179 source files to /mnt/work/bamboo-home/xml-data/build-dir/C2-SOFTWARE0-JDK16/tmp/classes-test
06-Feb-2014 10:55:05     [javac] 34 @Bindable metadata processed in round 1 in 1.16 secs.
06-Feb-2014 10:55:08     [javac] Note: Some input files use or override a deprecated API.
06-Feb-2014 10:55:08     [javac] Note: Recompile with -Xlint:deprecation for details.
06-Feb-2014 10:55:08
06-Feb-2014 10:55:08 clover.tasks:
06-Feb-2014 10:55:08
06-Feb-2014 10:55:08 compile.coverage:
06-Feb-2014 10:55:08
06-Feb-2014 10:55:08 basedir.check:
06-Feb-2014 10:55:08
06-Feb-2014 10:55:08 carrot2.common.basedir.message:
06-Feb-2014 10:55:08
06-Feb-2014 10:55:08 carrot2.dcs.resources.test:
06-Feb-2014 10:55:08      [copy] Copying 2 files to /mnt/work/bamboo-home/xml-data/build-dir/C2-SOFTWARE0-JDK16/tmp/classes-test
06-Feb-2014 10:55:08
06-Feb-2014 10:55:08 resources.test:
06-Feb-2014 10:55:08      [copy] Copying 32 files to /mnt/work/bamboo-home/xml-data/build-dir/C2-SOFTWARE0-JDK16/tmp/classes-test
06-Feb-2014 10:55:08
06-Feb-2014 10:55:08 test:
06-Feb-2014 10:55:08     [mkdir] Created dir: /mnt/work/bamboo-home/xml-data/build-dir/C2-SOFTWARE0-JDK16/tmp/test-report
06-Feb-2014 10:55:08     [mkdir] Created dir: /mnt/work/bamboo-home/xml-data/build-dir/C2-SOFTWARE0-JDK16/tmp/test-report-jira
06-Feb-2014 10:55:08    [junit4] <JUnit4> says ???! Master seed: 7DA2C1A8A7F1FABB
06-Feb-2014 10:55:08    [junit4] Your default console's encoding may not display certain unicode glyphs: US-ASCII
06-Feb-2014 10:55:09    [junit4] Executing 97 suites with 4 JVMs.
06-Feb-2014 10:55:09    [junit4]
06-Feb-2014 10:55:09    [junit4] Started J0 PID(26738@n19h65).
06-Feb-2014 10:55:09    [junit4] Started J3 PID(26743@n19h65).
06-Feb-2014 10:55:10    [junit4] Started J2 PID(26741@n19h65).
06-Feb-2014 10:55:10    [junit4] Started J1 PID(26739@n19h65).
06-Feb-2014 10:55:11    [junit4] Suite: org.carrot2.text.preprocessing.filter.NumericLabelFilterTest
06-Feb-2014 10:55:11    [junit4] Completed on J2 in 0.89s, 5 tests
06-Feb-2014 10:55:11    [junit4]
06-Feb-2014 10:55:11    [junit4] Suite: org.carrot2.text.preprocessing.LabelFormatterTest
06-Feb-2014 10:55:11    [junit4] Completed on J2 in 0.46s, 8 tests
06-Feb-2014 10:55:11    [junit4]
06-Feb-2014 10:55:12    [junit4] Suite: org.carrot2.core.ClusterTest
06-Feb-2014 10:55:12    [junit4] Completed on J2 in 0.42s, 21 tests
06-Feb-2014 10:55:12    [junit4]
06-Feb-2014 10:55:12    [junit4] Suite: org.carrot2.source.lucene.FSDirectoryWrapperTest
06-Feb-2014 10:55:12    [junit4] Completed on J1 in 1.74s, 1 test
06-Feb-2014 10:55:12    [junit4]
06-Feb-2014 10:55:12    [junit4] Suite: org.carrot2.util.GraphUtilsTest
06-Feb-2014 10:55:12    [junit4] Completed on J1 in 0.14s, 5 tests
06-Feb-2014 10:55:12    [junit4]
06-Feb-2014 10:55:12    [junit4] Suite: org.carrot2.text.linguistic.EnglishTest
06-Feb-2014 10:55:12    [junit4] Completed on J1 in 0.34s, 5 tests
06-Feb-2014 10:55:12    [junit4]
06-Feb-2014 10:55:13    [junit4] Suite: org.carrot2.source.pubmed.PubMedDocumentSourceTest
06-Feb-2014 10:55:13    [junit4] IGNOR/A 0.10s J1 | PubMedDocumentSourceTest.testURLsUnique
06-Feb-2014 10:55:13    [junit4]    > Assumption #1: 'usesexternalservices' test group is disabled (@UsesExternalServices)
06-Feb-2014 10:55:13    [junit4] IGNOR/A 0.01s J1 | PubMedDocumentSourceTest.testUtfCharacters
06-Feb-2014 10:55:13    [junit4]    > Assumption #1: 'usesexternalservices' test group is disabled (@UsesExternalServices)
06-Feb-2014 10:55:13    [junit4] IGNOR/A 0.02s J1 | PubMedDocumentSourceTest.testLargeQuery
06-Feb-2014 10:55:13    [junit4]    > Assumption #1: 'usesexternalservices' test group is disabled (@UsesExternalServices)
06-Feb-2014 10:55:13    [junit4] IGNOR/A 0.00s J1 | PubMedDocumentSourceTest.testNoResultsQuery
06-Feb-2014 10:55:13    [junit4]    > Assumption #1: 'usesexternalservices' test group is disabled (@UsesExternalServices)
06-Feb-2014 10:55:13    [junit4] IGNOR/A 0.00s J1 | PubMedDocumentSourceTest.testResultsTotal
06-Feb-2014 10:55:13    [junit4]    > Assumption #1: 'usesexternalservices' test group is disabled (@UsesExternalServices)
06-Feb-2014 10:55:13    [junit4] IGNOR/A 0.00s J1 | PubMedDocumentSourceTest.testHtmlUnescaping
06-Feb-2014 10:55:13    [junit4]    > Assumption #1: 'usesexternalservices' test group is disabled (@UsesExternalServices)
06-Feb-2014 10:55:13    [junit4] IGNOR/A 0.02s J1 | PubMedDocumentSourceTest.testSmallQuery
06-Feb-2014 10:55:13    [junit4]    > Assumption #1: 'usesexternalservices' test group is disabled (@UsesExternalServices)
06-Feb-2014 10:55:13    [junit4] IGNOR/A 0.01s J1 | PubMedDocumentSourceTest.testInCachingController
06-Feb-2014 10:55:13    [junit4]    > Assumption #1: 'usesexternalservices' test group is disabled (@UsesExternalServices)
06-Feb-2014 10:55:13    [junit4] Completed on J1 in 0.38s, 9 tests, 8 skipped
06-Feb-2014 10:55:13    [junit4]
06-Feb-2014 10:55:13    [junit4] Suite: org.carrot2.source.xml.XmlDocumentSourceTest
06-Feb-2014 10:55:13    [junit4] IGNOR/A 0.05s J0 | XmlDocumentSourceTest.testRemoteUrl
06-Feb-2014 10:55:13    [junit4]    > Assumption #1: carrot2.xml.feed.url.base property undefined.
06-Feb-2014 10:55:13    [junit4] Completed on J0 in 2.87s, 13 tests, 1 skipped
06-Feb-2014 10:55:13    [junit4]
06-Feb-2014 10:55:13    [junit4] Suite: org.carrot2.text.preprocessing.filter.StopWordLabelFilterMergedTest
06-Feb-2014 10:55:13    [junit4] Completed on J1 in 0.27s, 4 tests
06-Feb-2014 10:55:13    [junit4]
06-Feb-2014 10:55:13    [junit4] Suite: org.carrot2.webapp.util.UserAgentUtilsTest
06-Feb-2014 10:55:13    [junit4] Completed on J1 in 0.29s, 11 tests
06-Feb-2014 10:55:13    [junit4]
06-Feb-2014 10:55:13    [junit4] Suite: org.carrot2.text.util.MutableCharArrayTest
06-Feb-2014 10:55:13    [junit4] Completed on J1 in 0.14s, 8 tests
06-Feb-2014 10:55:13    [junit4]
06-Feb-2014 10:55:14    [junit4] Suite: org.carrot2.source.ambient.Odp239DocumentSourceTest
06-Feb-2014 10:55:14    [junit4] Completed on J3 in 3.91s, 6 tests
06-Feb-2014 10:55:14    [junit4]
06-Feb-2014 10:55:14    [junit4] Suite: org.carrot2.util.IntArrayPredicateIteratorTest
06-Feb-2014 10:55:14    [junit4] Completed on J3 in 0.23s, 5 tests
06-Feb-2014 10:55:14    [junit4]
06-Feb-2014 10:55:14    [junit4] Suite: org.carrot2.util.pool.FixedSizePoolTest
06-Feb-2014 10:55:14    [junit4] Completed on J0 in 1.04s, 7 tests
06-Feb-2014 10:55:14    [junit4]
06-Feb-2014 10:55:14    [junit4] Suite: org.carrot2.text.preprocessing.StemmerSyntheticTest
06-Feb-2014 10:55:14    [junit4] Completed on J0 in 0.63s, 12 tests
06-Feb-2014 10:55:14    [junit4]
06-Feb-2014 10:55:15    [junit4] Suite: org.carrot2.text.linguistic.ArabicTest
06-Feb-2014 10:55:15    [junit4] Completed on J0 in 0.48s, 4 tests
06-Feb-2014 10:55:15    [junit4]
06-Feb-2014 10:55:15    [junit4] Suite: org.carrot2.util.resource.ServletContextLocatorTest
06-Feb-2014 10:55:15    [junit4] Completed on J0 in 0.18s, 1 test
06-Feb-2014 10:55:15    [junit4]
06-Feb-2014 10:55:15    [junit4] Suite: org.carrot2.text.linguistic.PolishTest
06-Feb-2014 10:55:15    [junit4] Completed on J3 in 1.26s, 4 tests
06-Feb-2014 10:55:15    [junit4]
06-Feb-2014 10:55:15    [junit4] Suite: org.carrot2.text.linguistic.ThaiTokenizerTest
06-Feb-2014 10:55:15    [junit4] Completed on J0 in 0.29s, 3 tests
06-Feb-2014 10:55:15    [junit4]
06-Feb-2014 10:55:16    [junit4] Suite: org.carrot2.source.etools.EToolsDocumentSourceTest
06-Feb-2014 10:55:16    [junit4] IGNOR/A 0.06s J3 | EToolsDocumentSourceTest.testLargeQuery
06-Feb-2014 10:55:16    [junit4]    > Assumption #1: 'usesexternalservices' test group is disabled (@UsesExternalServices)
06-Feb-2014 10:55:16    [junit4] IGNOR/A 0.02s J3 | EToolsDocumentSourceTest.testGzipCompression
06-Feb-2014 10:55:16    [junit4]    > Assumption #1: 'usesexternalservices' test group is disabled (@UsesExternalServices)
06-Feb-2014 10:55:16    [junit4] IGNOR/A 0.02s J3 | EToolsDocumentSourceTest.testDataSourceResultsCount
06-Feb-2014 10:55:16    [junit4]    > Assumption #1: 'usesexternalservices' test group is disabled (@UsesExternalServices)
06-Feb-2014 10:55:16    [junit4] IGNOR/A 0.00s J3 | EToolsDocumentSourceTest.testDataSources
06-Feb-2014 10:55:16    [junit4]    > Assumption #1: 'usesexternalservices' test group is disabled (@UsesExternalServices)
06-Feb-2014 10:55:16    [junit4] IGNOR/A 0.00s J3 | EToolsDocumentSourceTest.testHtmlUnescaping
06-Feb-2014 10:55:16    [junit4]    > Assumption #1: 'usesexternalservices' test group is disabled (@UsesExternalServices)
06-Feb-2014 10:55:16    [junit4] IGNOR/A 0.00s J3 | EToolsDocumentSourceTest.testResultsTotal
06-Feb-2014 10:55:16    [junit4]    > Assumption #1: 'usesexternalservices' test group is disabled (@UsesExternalServices)
06-Feb-2014 10:55:16    [junit4] IGNOR/A 0.04s J3 | EToolsDocumentSourceTest.testSmallQuery
06-Feb-2014 10:55:16    [junit4]    > Assumption #1: 'usesexternalservices' test group is disabled (@UsesExternalServices)
06-Feb-2014 10:55:16    [junit4] IGNOR/A 0.00s J3 | EToolsDocumentSourceTest.testMetadataAvailable
06-Feb-2014 10:55:16    [junit4]    > Assumption #1: 'usesexternalservices' test group is disabled (@UsesExternalServices)
06-Feb-2014 10:55:16    [junit4] IGNOR/A 0.00s J3 | EToolsDocumentSourceTest.testUtfCharacters
06-Feb-2014 10:55:16    [junit4]    > Assumption #1: 'usesexternalservices' test group is disabled (@UsesExternalServices)
06-Feb-2014 10:55:16    [junit4] IGNOR/A 0.05s J3 | EToolsDocumentSourceTest.testNoResultsQuery
06-Feb-2014 10:55:16    [junit4]    > Assumption #1: 'usesexternalservices' test group is disabled (@UsesExternalServices)
06-Feb-2014 10:55:16    [junit4] IGNOR/A 0.00s J3 | EToolsDocumentSourceTest.testURLsUnique
06-Feb-2014 10:55:16    [junit4]    > Assumption #1: 'usesexternalservices' test group is disabled (@UsesExternalServices)
06-Feb-2014 10:55:16    [junit4] IGNOR/A 0.02s J3 | EToolsDocumentSourceTest.testInCachingController
06-Feb-2014 10:55:16    [junit4]    > Assumption #1: 'usesexternalservices' test group is disabled (@UsesExternalServices)
06-Feb-2014 10:55:16    [junit4] Completed on J3 in 0.35s, 12 tests, 12 skipped
06-Feb-2014 10:55:16    [junit4]
06-Feb-2014 10:55:16    [junit4] Suite: org.carrot2.output.metrics.PrecisionRecallMetricTest
06-Feb-2014 10:55:16    [junit4] Completed on J0 in 0.34s, 11 tests
06-Feb-2014 10:55:16    [junit4]
06-Feb-2014 10:55:16    [junit4] Suite: org.carrot2.webapp.source.WebDocumentSourceTest
06-Feb-2014 10:55:16    [junit4] IGNOR/A 0.03s J3 | WebDocumentSourceTest.testFirstResults
06-Feb-2014 10:55:16    [junit4]    > Assumption #1: 'usesexternalservices' test group is disabled (@UsesExternalServices)
06-Feb-2014 10:55:16    [junit4] IGNOR/A 0.00s J3 | WebDocumentSourceTest.testSmallQuery
06-Feb-2014 10:55:16    [junit4]    > Assumption #1: 'usesexternalservices' test group is disabled (@UsesExternalServices)
06-Feb-2014 10:55:16    [junit4] IGNOR/A 0.00s J3 | WebDocumentSourceTest.testURLsUnique
06-Feb-2014 10:55:16    [junit4]    > Assumption #1: 'usesexternalservices' test group is disabled (@UsesExternalServices)
06-Feb-2014 10:55:16    [junit4] IGNOR/A 0.02s J3 | WebDocumentSourceTest.testResultsTotal
06-Feb-2014 10:55:16    [junit4]    > Assumption #1: 'usesexternalservices' test group is disabled (@UsesExternalServices)
06-Feb-2014 10:55:16    [junit4] IGNOR/A 0.00s J3 | WebDocumentSourceTest.testInCachingController
06-Feb-2014 10:55:16    [junit4]    > Assumption #1: 'usesexternalservices' test group is disabled (@UsesExternalServices)
06-Feb-2014 10:55:16    [junit4] IGNOR/A 0.00s J3 | WebDocumentSourceTest.testNoResultsQuery
06-Feb-2014 10:55:16    [junit4]    > Assumption #1: 'usesexternalservices' test group is disabled (@UsesExternalServices)
06-Feb-2014 10:55:16    [junit4] IGNOR/A 0.04s J3 | WebDocumentSourceTest.testLargeQuery
06-Feb-2014 10:55:16    [junit4]    > Assumption #1: 'usesexternalservices' test group is disabled (@UsesExternalServices)
06-Feb-2014 10:55:16    [junit4] IGNOR/A 0.01s J3 | WebDocumentSourceTest.testRequestIndependence
06-Feb-2014 10:55:16    [junit4]    > Assumption #1: 'usesexternalservices' test group is disabled (@UsesExternalServices)
06-Feb-2014 10:55:16    [junit4] IGNOR/A 0.00s J3 | WebDocumentSourceTest.testUtfCharacters
06-Feb-2014 10:55:16    [junit4]    > Assumption #1: 'usesexternalservices' test group is disabled (@UsesExternalServices)
06-Feb-2014 10:55:16    [junit4] IGNOR/A 0.00s J3 | WebDocumentSourceTest.testHtmlUnescaping
06-Feb-2014 10:55:16    [junit4]    > Assumption #1: 'usesexternalservices' test group is disabled (@UsesExternalServices)
06-Feb-2014 10:55:16    [junit4] Completed on J3 in 0.20s, 11 tests, 10 skipped
06-Feb-2014 10:55:16    [junit4]
06-Feb-2014 10:55:16    [junit4] Suite: org.carrot2.source.microsoft.Bing3NewsDocumentSourceTest
06-Feb-2014 10:55:16    [junit4] IGNOR/A 0.00s J0 | Bing3NewsDocumentSourceTest.testNewsCategory
06-Feb-2014 10:55:16    [junit4]    > Assumption #1: 'usesexternalservices' test group is disabled (@UsesExternalServices)
06-Feb-2014 10:55:16    [junit4] IGNOR/A 0.00s J0 | Bing3NewsDocumentSourceTest.testMetadataAvailable
06-Feb-2014 10:55:16    [junit4]    > Assumption #1: 'usesexternalservices' test group is disabled (@UsesExternalServices)
06-Feb-2014 10:55:16    [junit4] IGNOR/A 0.02s J0 | Bing3NewsDocumentSourceTest.testPresidentQuery
06-Feb-2014 10:55:16    [junit4]    > Assumption #1: 'usesexternalservices' test group is disabled (@UsesExternalServices)
06-Feb-2014 10:55:16    [junit4] Completed on J0 in 0.12s, 3 tests, 3 skipped
06-Feb-2014 10:55:16    [junit4]
06-Feb-2014 10:55:16    [junit4] Suite: org.carrot2.core.ComponentSuitesTest
06-Feb-2014 10:55:16    [junit4] Completed on J2 in 4.14s, 3 tests
06-Feb-2014 10:55:16    [junit4]
06-Feb-2014 10:55:16    [junit4] Suite: org.carrot2.text.preprocessing.DocumentAssignerTest
06-Feb-2014 10:55:16    [junit4] Completed on J0 in 0.16s, 8 tests
06-Feb-2014 10:55:16    [junit4]
06-Feb-2014 10:55:16    [junit4] Suite: org.carrot2.output.metrics.NormalizedMutualInformationMetricTest
06-Feb-2014 10:55:16    [junit4] Completed on J2 in 0.29s, 11 tests
06-Feb-2014 10:55:16    [junit4]
06-Feb-2014 10:55:16    [junit4] Suite: org.carrot2.text.preprocessing.filter.StopLabelFilterEnglishTest
06-Feb-2014 10:55:16    [junit4] Completed on J0 in 0.17s, 4 tests
06-Feb-2014 10:55:16    [junit4]
06-Feb-2014 10:55:16    [junit4] Suite: org.carrot2.util.RollingWindowAverageTest
06-Feb-2014 10:55:16    [junit4] Completed on J0 in 0.15s, 3 tests
06-Feb-2014 10:55:16    [junit4]
06-Feb-2014 10:55:16    [junit4] Suite: org.carrot2.util.resource.ResourceLookupTest
06-Feb-2014 10:55:16    [junit4] Completed on J0 in 0.14s, 6 tests
06-Feb-2014 10:55:16    [junit4]
06-Feb-2014 10:55:17    [junit4] Suite: org.carrot2.text.preprocessing.WordMarkerTest
06-Feb-2014 10:55:17    [junit4] Completed on J0 in 0.12s, 2 tests
06-Feb-2014 10:55:17    [junit4]
06-Feb-2014 10:55:17    [junit4] Suite: org.carrot2.util.pool.SoftUnboundedPoolTest
06-Feb-2014 10:55:17    [junit4] Completed on J2 in 1.20s, 6 tests
06-Feb-2014 10:55:17    [junit4]
06-Feb-2014 10:55:18    [junit4] Suite: org.carrot2.text.preprocessing.PhraseExtractorTest
06-Feb-2014 10:55:18    [junit4] Completed on J1 in 4.32s, 21 tests
06-Feb-2014 10:55:18    [junit4]
06-Feb-2014 10:55:18    [junit4] Suite: org.carrot2.source.opensearch.OpenSearchDocumentSourceByResultIncrementTest
06-Feb-2014 10:55:18    [junit4] IGNOR/A 0.00s J1 | OpenSearchDocumentSourceByResultIncrementTest.testURLsUnique
06-Feb-2014 10:55:18    [junit4]    > Assumption #1: 'usesexternalservices' test group is disabled (@UsesExternalServices)
06-Feb-2014 10:55:18    [junit4] IGNOR/A 0.00s J1 | OpenSearchDocumentSourceByResultIncrementTest.testUtfCharacters
06-Feb-2014 10:55:18    [junit4]    > Assumption #1: 'usesexternalservices' test group is disabled (@UsesExternalServices)
06-Feb-2014 10:55:18    [junit4] IGNOR/A 0.01s J1 | OpenSearchDocumentSourceByResultIncrementTest.testLargeQuery
06-Feb-2014 10:55:18    [junit4]    > Assumption #1: 'usesexternalservices' test group is disabled (@UsesExternalServices)
06-Feb-2014 10:55:18    [junit4] IGNOR/A 0.00s J1 | OpenSearchDocumentSourceByResultIncrementTest.testNoResultsQuery
06-Feb-2014 10:55:18    [junit4]    > Assumption #1: 'usesexternalservices' test group is disabled (@UsesExternalServices)
06-Feb-2014 10:55:18    [junit4] IGNOR/A 0.00s J1 | OpenSearchDocumentSourceByResultIncrementTest.testResultsTotal
06-Feb-2014 10:55:18    [junit4]    > Assumption #1: 'usesexternalservices' test group is disabled (@UsesExternalServices)
06-Feb-2014 10:55:18    [junit4] IGNOR/A 0.00s J1 | OpenSearchDocumentSourceByResultIncrementTest.testHtmlUnescaping
06-Feb-2014 10:55:18    [junit4]    > Assumption #1: 'usesexternalservices' test group is disabled (@UsesExternalServices)
06-Feb-2014 10:55:18    [junit4] IGNOR/A 0.03s J1 | OpenSearchDocumentSourceByResultIncrementTest.testSmallQuery
06-Feb-2014 10:55:18    [junit4]    > Assumption #1: 'usesexternalservices' test group is disabled (@UsesExternalServices)
06-Feb-2014 10:55:18    [junit4] IGNOR/A 0.00s J1 | OpenSearchDocumentSourceByResultIncrementTest.testInCachingController
06-Feb-2014 10:55:18    [junit4]    > Assumption #1: 'usesexternalservices' test group is disabled (@UsesExternalServices)
06-Feb-2014 10:55:18    [junit4] Completed on J1 in 0.18s, 9 tests, 8 skipped
06-Feb-2014 10:55:18    [junit4]
06-Feb-2014 10:55:18    [junit4] Suite: org.carrot2.source.pubmed.PubMedContentHandlerTest
06-Feb-2014 10:55:18    [junit4] Completed on J3 in 2.51s, 1 test
06-Feb-2014 10:55:18    [junit4]
06-Feb-2014 10:55:19    [junit4] Suite: org.carrot2.util.httpclient.HttpClientFactoryTest
06-Feb-2014 10:55:19    [junit4] Completed on J1 in 1.47s, 1 test
06-Feb-2014 10:55:19    [junit4]
06-Feb-2014 10:55:19    [junit4] Suite: org.carrot2.text.linguistic.ChineseTokenizerTest
06-Feb-2014 10:55:19    [junit4] Completed on J2 in 1.97s, 5 tests
06-Feb-2014 10:55:19    [junit4]
06-Feb-2014 10:55:20    [junit4] Suite: org.carrot2.util.StringUtilsTest
06-Feb-2014 10:55:20    [junit4] Completed on J1 in 0.19s, 9 tests
06-Feb-2014 10:55:20    [junit4]
06-Feb-2014 10:55:20    [junit4] Suite: org.carrot2.webapp.filter.QueryWordHighlighterTest
06-Feb-2014 10:55:20    [junit4] Completed on J2 in 0.34s, 12 tests
06-Feb-2014 10:55:20    [junit4]
06-Feb-2014 10:55:20    [junit4] Suite: org.carrot2.text.preprocessing.filter.MinLengthLabelFilterTest
06-Feb-2014 10:55:20    [junit4] Completed on J2 in 0.14s, 4 tests
06-Feb-2014 10:55:20    [junit4]
06-Feb-2014 10:55:20    [junit4] Suite: org.carrot2.util.resource.URLResourceWithParamsTest
06-Feb-2014 10:55:20    [junit4] Completed on J2 in 0.05s, 2 tests
06-Feb-2014 10:55:20    [junit4]
06-Feb-2014 10:55:20    [junit4] Suite: org.carrot2.core.ProcessingResultTest
06-Feb-2014 10:55:20    [junit4] Completed on J3 in 1.74s, 15 tests
06-Feb-2014 10:55:20    [junit4]
06-Feb-2014 10:55:20    [junit4] Suite: org.carrot2.text.suffixtree.SuffixTreeTest
06-Feb-2014 10:55:20    [junit4] Completed on J1 in 0.21s, 9 tests
06-Feb-2014 10:55:20    [junit4]
06-Feb-2014 10:55:20    [junit4] Suite: org.carrot2.source.microsoft.Bing3ImageDocumentSourceTest
06-Feb-2014 10:55:20    [junit4] IGNOR/A 0.20s J2 | Bing3ImageDocumentSourceTest.testMetadataAvailable
06-Feb-2014 10:55:20    [junit4]    > Assumption #1: 'usesexternalservices' test group is disabled (@UsesExternalServices)
06-Feb-2014 10:55:20    [junit4] IGNOR/A 0.00s J2 | Bing3ImageDocumentSourceTest.testCatsQuery
06-Feb-2014 10:55:20    [junit4]    > Assumption #1: 'usesexternalservices' test group is disabled (@UsesExternalServices)
06-Feb-2014 10:55:20    [junit4] Completed on J2 in 0.25s, 2 tests, 2 skipped
06-Feb-2014 10:55:20    [junit4]
06-Feb-2014 10:55:20    [junit4] Suite: org.carrot2.text.preprocessing.filter.QueryLabelFilterTest
06-Feb-2014 10:55:20    [junit4] Completed on J1 in 0.12s, 5 tests
06-Feb-2014 10:55:20    [junit4]
06-Feb-2014 10:55:20    [junit4] Suite: org.carrot2.util.ExceptionUtilsTest
06-Feb-2014 10:55:20    [junit4] Completed on J2 in 0.07s, 5 tests
06-Feb-2014 10:55:20    [junit4]
06-Feb-2014 10:55:20    [junit4] Suite: org.carrot2.text.util.MutableCharArrayUtilsTest
06-Feb-2014 10:55:20    [junit4] Completed on J2 in 0.03s, 2 tests
06-Feb-2014 10:55:20    [junit4]
06-Feb-2014 10:55:20    [junit4] Suite: org.carrot2.text.linguistic.ExtendedWhitespaceTokenizerTest
06-Feb-2014 10:55:20    [junit4] Completed on J1 in 0.20s, 9 tests
06-Feb-2014 10:55:20    [junit4]
06-Feb-2014 10:55:20    [junit4] Suite: org.carrot2.output.metrics.IdealPartitioningBasedMetricTest
06-Feb-2014 10:55:20    [junit4] Completed on J2 in 0.05s, 1 test
06-Feb-2014 10:55:20    [junit4]
06-Feb-2014 10:55:20    [junit4] Suite: org.carrot2.util.attribute.ResourceFromStringTest
06-Feb-2014 10:55:20    [junit4] Completed on J1 in 0.05s, 2 tests
06-Feb-2014 10:55:20    [junit4]
06-Feb-2014 10:55:20    [junit4] Suite: org.carrot2.matrix.MatrixUtilsTest
06-Feb-2014 10:55:20    [junit4] Completed on J3 in 0.34s, 16 tests
06-Feb-2014 10:55:20    [junit4]
06-Feb-2014 10:55:21    [junit4] Suite: org.carrot2.text.clustering.MultilingualClusteringTest
06-Feb-2014 10:55:21    [junit4] Completed on J3 in 0.36s, 16 tests
06-Feb-2014 10:55:21    [junit4]
06-Feb-2014 10:55:21    [junit4] Suite: org.carrot2.text.preprocessing.SuffixSorterTest
06-Feb-2014 10:55:21    [junit4] Completed on J3 in 0.20s, 7 tests
06-Feb-2014 10:55:21    [junit4]
06-Feb-2014 10:55:21    [junit4] Suite: org.carrot2.source.ambient.AmbientDocumentSourceTest
06-Feb-2014 10:55:21    [junit4] Completed on J2 in 0.81s, 6 tests
06-Feb-2014 10:55:21    [junit4]
06-Feb-2014 10:55:21    [junit4] Suite: org.carrot2.text.util.CharArrayComparatorsTest
06-Feb-2014 10:55:21    [junit4] Completed on J3 in 0.13s, 3 tests
06-Feb-2014 10:55:21    [junit4]
06-Feb-2014 10:55:21    [junit4] Suite: org.carrot2.util.IndirectSorterTest
06-Feb-2014 10:55:21    [junit4] Completed on J2 in 0.28s, 23 tests
06-Feb-2014 10:55:21    [junit4]
06-Feb-2014 10:55:22    [junit4] Suite: org.carrot2.util.attribute.AttributeValueSetsTest
06-Feb-2014 10:55:22    [junit4] Completed on J3 in 0.49s, 16 tests
06-Feb-2014 10:55:22    [junit4]
06-Feb-2014 10:55:22    [junit4] Suite: org.carrot2.text.preprocessing.PreprocessedDocumentScannerTest
06-Feb-2014 10:55:22    [junit4] Completed on J3 in 0.19s, 5 tests
06-Feb-2014 10:55:22    [junit4]
06-Feb-2014 10:55:22    [junit4] Suite: org.carrot2.output.metrics.ContaminationMetricTest
06-Feb-2014 10:55:22    [junit4] Completed on J3 in 0.28s, 12 tests
06-Feb-2014 10:55:22    [junit4]
06-Feb-2014 10:55:22    [junit4] Suite: org.carrot2.text.linguistic.DefaultTokenizerFactoryTest
06-Feb-2014 10:55:22    [junit4] Completed on J1 in 1.81s, 1 test
06-Feb-2014 10:55:22    [junit4]
06-Feb-2014 10:55:22    [junit4] Suite: org.carrot2.source.microsoft.Bing3WebDocumentSourceTest
06-Feb-2014 10:55:22    [junit4] IGNOR/A 0.01s J1 | Bing3WebDocumentSourceTest.testSmallQuery
06-Feb-2014 10:55:22    [junit4]    > Assumption #1: 'usesexternalservices' test group is disabled (@UsesExternalServices)
06-Feb-2014 10:55:22    [junit4] IGNOR/A 0.00s J1 | Bing3WebDocumentSourceTest.testNoResultsQuery
06-Feb-2014 10:55:22    [junit4]    > Assumption #1: 'usesexternalservices' test group is disabled (@UsesExternalServices)
06-Feb-2014 10:55:22    [junit4] IGNOR/A 0.00s J1 | Bing3WebDocumentSourceTest.testMetadataAvailable
06-Feb-2014 10:55:22    [junit4]    > Assumption #1: 'usesexternalservices' test group is disabled (@UsesExternalServices)
06-Feb-2014 10:55:22    [junit4] IGNOR/A 0.04s J1 | Bing3WebDocumentSourceTest.testResultsTotal
06-Feb-2014 10:55:22    [junit4]    > Assumption #1: 'usesexternalservices' test group is disabled (@UsesExternalServices)
06-Feb-2014 10:55:22    [junit4] IGNOR/A 0.01s J1 | Bing3WebDocumentSourceTest.testHtmlUnescaping
06-Feb-2014 10:55:22    [junit4]    > Assumption #1: 'usesexternalservices' test group is disabled (@UsesExternalServices)
06-Feb-2014 10:55:22    [junit4] IGNOR/A 0.00s J1 | Bing3WebDocumentSourceTest.testUtfCharacters
06-Feb-2014 10:55:22    [junit4]    > Assumption #1: 'usesexternalservices' test group is disabled (@UsesExternalServices)
06-Feb-2014 10:55:22    [junit4] IGNOR/A 0.02s J1 | Bing3WebDocumentSourceTest.testSpeculativeMode
06-Feb-2014 10:55:22    [junit4]    > Assumption #1: 'usesexternalservices' test group is disabled (@UsesExternalServices)
06-Feb-2014 10:55:22    [junit4] IGNOR/A 0.00s J1 | Bing3WebDocumentSourceTest.testURLsUnique
06-Feb-2014 10:55:22    [junit4]    > Assumption #1: 'usesexternalservices' test group is disabled (@UsesExternalServices)
06-Feb-2014 10:55:22    [junit4] IGNOR/A 0.00s J1 | Bing3WebDocumentSourceTest.testInCachingController
06-Feb-2014 10:55:22    [junit4]    > Assumption #1: 'usesexternalservices' test group is disabled (@UsesExternalServices)
06-Feb-2014 10:55:22    [junit4] IGNOR/A 0.01s J1 | Bing3WebDocumentSourceTest.testQueryLargerThanPage
06-Feb-2014 10:55:22    [junit4]    > Assumption #1: 'usesexternalservices' test group is disabled (@UsesExternalServices)
06-Feb-2014 10:55:22    [junit4] IGNOR/A 0.00s J1 | Bing3WebDocumentSourceTest.testLargeQuery
06-Feb-2014 10:55:22    [junit4]    > Assumption #1: 'usesexternalservices' test group is disabled (@UsesExternalServices)
06-Feb-2014 10:55:22    [junit4] IGNOR/A 0.00s J1 | Bing3WebDocumentSourceTest.testPdfFileType
06-Feb-2014 10:55:22    [junit4]    > Assumption #1: 'usesexternalservices' test group is disabled (@UsesExternalServices)
06-Feb-2014 10:55:22    [junit4] IGNOR/A 0.01s J1 | Bing3WebDocumentSourceTest.testConservativeMode
06-Feb-2014 10:55:22    [junit4]    > Assumption #1: 'usesexternalservices' test group is disabled (@UsesExternalServices)
06-Feb-2014 10:55:22    [junit4] IGNOR/A 0.00s J1 | Bing3WebDocumentSourceTest.testMarketOption
06-Feb-2014 10:55:22    [junit4]    > Assumption #1: 'usesexternalservices' test group is disabled (@UsesExternalServices)
06-Feb-2014 10:55:22    [junit4] IGNOR/A 0.00s J1 | Bing3WebDocumentSourceTest.testSiteOption
06-Feb-2014 10:55:22    [junit4]    > Assumption #1: 'usesexternalservices' test group is disabled (@UsesExternalServices)
06-Feb-2014 10:55:22    [junit4] IGNOR/A 0.01s J1 | Bing3WebDocumentSourceTest.testDocFileType
06-Feb-2014 10:55:22    [junit4]    > Assumption #1: 'usesexternalservices' test group is disabled (@UsesExternalServices)
06-Feb-2014 10:55:22    [junit4] Completed on J1 in 0.15s, 16 tests, 16 skipped
06-Feb-2014 10:55:22    [junit4]
06-Feb-2014 10:55:22    [junit4] Suite: org.carrot2.util.LinearApproximationTest
06-Feb-2014 10:55:22    [junit4] Completed on J1 in 0.08s, 3 tests
06-Feb-2014 10:55:22    [junit4]
06-Feb-2014 10:55:23    [junit4] Suite: org.carrot2.clustering.lingo.ClusterMergerTest
06-Feb-2014 10:55:23    [junit4] Completed on J3 in 0.39s, 4 tests
06-Feb-2014 10:55:23    [junit4]
06-Feb-2014 10:55:23    [junit4] Suite: org.carrot2.text.preprocessing.CaseNormalizerTest
06-Feb-2014 10:55:23    [junit4] Completed on J3 in 0.42s, 14 tests
06-Feb-2014 10:55:23    [junit4]
06-Feb-2014 10:55:23    [junit4] Suite: org.carrot2.core.DocumentTest
06-Feb-2014 10:55:23    [junit4] Completed on J3 in 0.07s, 3 tests
06-Feb-2014 10:55:23    [junit4]
06-Feb-2014 10:55:23    [junit4] Suite: org.carrot2.util.CharArrayUtilsTest
06-Feb-2014 10:55:23    [junit4] Completed on J3 in 0.12s, 7 tests, 2 skipped
06-Feb-2014 10:55:23    [junit4]
06-Feb-2014 10:55:25    [junit4] Suite: org.carrot2.source.lucene.LuceneDocumentSourceTest
06-Feb-2014 10:55:25    [junit4] IGNOR/A 0.02s J2 | LuceneDocumentSourceTest.testSmallQuery
06-Feb-2014 10:55:25    [junit4]    > Assumption #1: 'usesexternalservices' test group is disabled (@UsesExternalServices)
06-Feb-2014 10:55:25    [junit4] IGNOR/A 0.01s J2 | LuceneDocumentSourceTest.testURLsUnique
06-Feb-2014 10:55:25    [junit4]    > Assumption #1: 'usesexternalservices' test group is disabled (@UsesExternalServices)
06-Feb-2014 10:55:25    [junit4] IGNOR/A 0.02s J2 | LuceneDocumentSourceTest.testLargeQuery
06-Feb-2014 10:55:25    [junit4]    > Assumption #1: 'usesexternalservices' test group is disabled (@UsesExternalServices)
06-Feb-2014 10:55:25    [junit4] IGNOR/A 0.01s J2 | LuceneDocumentSourceTest.testNoResultsQuery
06-Feb-2014 10:55:25    [junit4]    > Assumption #1: 'usesexternalservices' test group is disabled (@UsesExternalServices)
06-Feb-2014 10:55:25    [junit4] IGNOR/A 0.02s J2 | LuceneDocumentSourceTest.testUtfCharacters
06-Feb-2014 10:55:25    [junit4]    > Assumption #1: 'usesexternalservices' test group is disabled (@UsesExternalServices)
06-Feb-2014 10:55:25    [junit4] IGNOR/A 0.02s J2 | LuceneDocumentSourceTest.testInCachingController
06-Feb-2014 10:55:25    [junit4]    > Assumption #1: 'usesexternalservices' test group is disabled (@UsesExternalServices)
06-Feb-2014 10:55:25    [junit4] IGNOR/A 0.01s J2 | LuceneDocumentSourceTest.testHtmlUnescaping
06-Feb-2014 10:55:25    [junit4]    > Assumption #1: 'usesexternalservices' test group is disabled (@UsesExternalServices)
06-Feb-2014 10:55:25    [junit4] IGNOR/A 0.00s J2 | LuceneDocumentSourceTest.testResultsTotal
06-Feb-2014 10:55:25    [junit4]    > Assumption #1: 'usesexternalservices' test group is disabled (@UsesExternalServices)
06-Feb-2014 10:55:25    [junit4] Completed on J2 in 3.36s, 19 tests, 8 skipped
06-Feb-2014 10:55:25    [junit4]
06-Feb-2014 10:55:25    [junit4] Suite: org.carrot2.source.opensearch.OpenSearchDocumentSourceTest
06-Feb-2014 10:55:25    [junit4] Completed on J2 in 0.12s, 5 tests
06-Feb-2014 10:55:25    [junit4]
06-Feb-2014 10:55:26    [junit4] Suite: org.carrot2.clustering.lingo.LingoClusteringAlgorithmTest
06-Feb-2014 10:55:26    [junit4] IGNOR/A 0.00s J3 | LingoClusteringAlgorithmTest.testStress
06-Feb-2014 10:55:26    [junit4]    > Assumption #1: 'nightly' test group is disabled (@Nightly)
06-Feb-2014 10:55:26    [junit4] Completed on J3 in 2.79s, 10 tests, 1 skipped
06-Feb-2014 10:55:26    [junit4]
06-Feb-2014 10:55:28    [junit4] Suite: org.carrot2.clustering.kmeans.BisectingKMeansClusteringAlgorithmTest
06-Feb-2014 10:55:28    [junit4] IGNOR/A 0.00s J1 | BisectingKMeansClusteringAlgorithmTest.testStress
06-Feb-2014 10:55:28    [junit4]    > Assumption #1: 'nightly' test group is disabled (@Nightly)
06-Feb-2014 10:55:28    [junit4] Completed on J1 in 5.41s, 8 tests, 1 skipped
06-Feb-2014 10:55:28    [junit4]
06-Feb-2014 10:55:28    [junit4] Suite: org.carrot2.dcs.DcsAppTest
06-Feb-2014 10:55:28    [junit4] IGNOR/A 0.01s J2 | DcsAppTest.testOutputPage
06-Feb-2014 10:55:28    [junit4]    > Assumption #1: 'nightly' test group is disabled (@Nightly)
06-Feb-2014 10:55:28    [junit4] IGNOR/A 0.00s J2 | DcsAppTest.testJsonOutput
06-Feb-2014 10:55:28    [junit4]    > Assumption #1: 'nightly' test group is disabled (@Nightly)
06-Feb-2014 10:55:28    [junit4] IGNOR/A 0.02s J2 | DcsAppTest.directFeedAttributeOverriding
06-Feb-2014 10:55:28    [junit4]    > Assumption #1: 'nightly' test group is disabled (@Nightly)
06-Feb-2014 10:55:28    [junit4] IGNOR/A 0.00s J2 | DcsAppTest.testOnlyClusters
06-Feb-2014 10:55:28    [junit4]    > Assumption #1: 'nightly' test group is disabled (@Nightly)
06-Feb-2014 10:55:28    [junit4] IGNOR/A 0.02s J2 | DcsAppTest.testGetWithExternalSource
06-Feb-2014 10:55:28    [junit4]    > Assumption #1: 'usesexternalservices' test group is disabled (@UsesExternalServices)
06-Feb-2014 10:55:28    [junit4] IGNOR/A 0.01s J2 | DcsAppTest.testPostUrlEncodedWithC2Stream
06-Feb-2014 10:55:28    [junit4]    > Assumption #1: 'nightly' test group is disabled (@Nightly)
06-Feb-2014 10:55:28    [junit4] IGNOR/A 0.01s J2 | DcsAppTest.testFileUpload
06-Feb-2014 10:55:28    [junit4]    > Assumption #1: 'nightly' test group is disabled (@Nightly)
06-Feb-2014 10:55:28    [junit4] IGNOR/A 0.00s J2 | DcsAppTest.testParametersPage
06-Feb-2014 10:55:28    [junit4]    > Assumption #1: 'nightly' test group is disabled (@Nightly)
06-Feb-2014 10:55:28    [junit4] IGNOR/A 0.01s J2 | DcsAppTest.testInputPage
06-Feb-2014 10:55:28    [junit4]    > Assumption #1: 'nightly' test group is disabled (@Nightly)
06-Feb-2014 10:55:28    [junit4] IGNOR/A 0.01s J2 | DcsAppTest.testExternalSource
06-Feb-2014 10:55:28    [junit4]    > Assumption #1: 'usesexternalservices' test group is disabled (@UsesExternalServices)
06-Feb-2014 10:55:28    [junit4] IGNOR/A 0.00s J2 | DcsAppTest.testJsonCallback
06-Feb-2014 10:55:28    [junit4]    > Assumption #1: 'nightly' test group is disabled (@Nightly)
06-Feb-2014 10:55:28    [junit4] IGNOR/A 0.02s J2 | DcsAppTest.testStartPage
06-Feb-2014 10:55:28    [junit4]    > Assumption #1: 'nightly' test group is disabled (@Nightly)
06-Feb-2014 10:55:28    [junit4] IGNOR/A 0.01s J2 | DcsAppTest.testPostWithVariousC2StreamXmlEncoding
06-Feb-2014 10:55:28    [junit4]    > Assumption #1: 'nightly' test group is disabled (@Nightly)
06-Feb-2014 10:55:28    [junit4] IGNOR/A 0.01s J2 | DcsAppTest.testTextarea
06-Feb-2014 10:55:28    [junit4]    > Assumption #1: 'nightly' test group is disabled (@Nightly)
06-Feb-2014 10:55:28    [junit4] IGNOR/A 0.00s J2 | DcsAppTest.testPostUrlEncodedWithExternalSource
06-Feb-2014 10:55:28    [junit4]    > Assumption #1: 'usesexternalservices' test group is disabled (@UsesExternalServices)
06-Feb-2014 10:55:28    [junit4] Completed on J2 in 2.30s, 16 tests, 16 skipped
06-Feb-2014 10:55:28    [junit4]
06-Feb-2014 10:55:29    [junit4] Suite: org.carrot2.text.linguistic.DefaultLexicalDataFactoryTest
06-Feb-2014 10:55:29    [junit4] Completed on J2 in 0.65s, 3 tests
06-Feb-2014 10:55:29    [junit4]
06-Feb-2014 10:55:30    [junit4] Suite: org.carrot2.clustering.synthetic.ByUrlClusteringAlgorithmTest
06-Feb-2014 10:55:30    [junit4] IGNOR/A 0.00s J2 | ByUrlClusteringAlgorithmTest.testStress
06-Feb-2014 10:55:30    [junit4]    > Assumption #1: 'nightly' test group is disabled (@Nightly)
06-Feb-2014 10:55:30    [junit4] Completed on J2 in 0.51s, 11 tests, 1 skipped
06-Feb-2014 10:55:30    [junit4]
06-Feb-2014 10:55:30    [junit4] Suite: org.carrot2.text.preprocessing.StemmerEnglishTest
06-Feb-2014 10:55:30    [junit4] Completed on J2 in 0.15s, 3 tests
06-Feb-2014 10:55:30    [junit4]
06-Feb-2014 10:55:30    [junit4] Suite: org.carrot2.clustering.lingo.ClusterLabelBuilderTest
06-Feb-2014 10:55:30    [junit4] Completed on J2 in 0.28s, 6 tests
06-Feb-2014 10:55:30    [junit4]
06-Feb-2014 10:55:31    [junit4] Suite: org.carrot2.clustering.synthetic.ByFieldClusteringAlgorithmTest
06-Feb-2014 10:55:31    [junit4] IGNOR/A 0.03s J2 | ByFieldClusteringAlgorithmTest.testStress
06-Feb-2014 10:55:31    [junit4]    > Assumption #1: 'nightly' test group is disabled (@Nightly)
06-Feb-2014 10:55:31    [junit4] Completed on J2 in 0.23s, 8 tests, 1 skipped
06-Feb-2014 10:55:31    [junit4]
06-Feb-2014 10:55:31    [junit4] Suite: org.carrot2.text.vsm.PhraseMatrixBuilderTest
06-Feb-2014 10:55:31    [junit4] Completed on J2 in 0.19s, 6 tests
06-Feb-2014 10:55:31    [junit4]
06-Feb-2014 10:55:31    [junit4] Suite: org.carrot2.util.simplexml.SimpleXmlWrappersTest
06-Feb-2014 10:55:31    [junit4] Completed on J1 in 3.43s, 28 tests
06-Feb-2014 10:55:31    [junit4]
06-Feb-2014 10:55:31    [junit4] Suite: org.carrot2.text.linguistic.DefaultStemmerFactoryTest
06-Feb-2014 10:55:31    [junit4] Completed on J2 in 0.20s, 2 tests
06-Feb-2014 10:55:31    [junit4]
06-Feb-2014 10:55:31    [junit4] Suite: org.carrot2.matrix.factorization.MatrixFactorizationTest
06-Feb-2014 10:55:31    [junit4] Completed on J1 in 0.21s, 6 tests
06-Feb-2014 10:55:31    [junit4]
06-Feb-2014 10:55:32    [junit4] Suite: org.carrot2.core.ClusterWithParentTest
06-Feb-2014 10:55:32    [junit4] Completed on J2 in 0.17s, 9 tests
06-Feb-2014 10:55:32    [junit4]
06-Feb-2014 10:55:32    [junit4] Suite: org.carrot2.text.vsm.TermDocumentMatrixBuilderTest
06-Feb-2014 10:55:32    [junit4] Completed on J1 in 0.22s, 8 tests
06-Feb-2014 10:55:32    [junit4]
06-Feb-2014 10:55:32    [junit4] Suite: org.carrot2.source.SearchRangeTest
06-Feb-2014 10:55:32    [junit4] Completed on J2 in 0.20s, 12 tests
06-Feb-2014 10:55:32    [junit4]
06-Feb-2014 10:55:32    [junit4] Suite: org.carrot2.text.preprocessing.TokenizerTest
06-Feb-2014 10:55:32    [junit4] Completed on J1 in 0.21s, 7 tests
06-Feb-2014 10:55:32    [junit4]
06-Feb-2014 10:55:32    [junit4] Suite: org.carrot2.clustering.stc.STCClusteringAlgorithmTest
06-Feb-2014 10:55:32    [junit4] IGNOR/A 0.01s J3 | STCClusteringAlgorithmTest.testStress
06-Feb-2014 10:55:32    [junit4]    > Assumption #1: 'nightly' test group is disabled (@Nightly)
06-Feb-2014 10:55:32    [junit4] Completed on J3 in 5.57s, 11 tests, 1 skipped
06-Feb-2014 10:55:32    [junit4]
06-Feb-2014 10:55:32    [junit4] Suite: org.carrot2.clustering.stc.GeneralizedSuffixTreeTest
06-Feb-2014 10:55:32    [junit4] Completed on J2 in 0.11s, 3 tests
06-Feb-2014 10:55:32    [junit4]
06-Feb-2014 10:55:32    [junit4] Suite: org.carrot2.text.preprocessing.filter.StopWordLabelFilterSyntheticTest
06-Feb-2014 10:55:32    [junit4] Completed on J1 in 0.19s, 7 tests
06-Feb-2014 10:55:32    [junit4]
06-Feb-2014 10:55:32    [junit4] Suite: org.carrot2.text.preprocessing.filter.StopWordLabelFilterEnglishTest
06-Feb-2014 10:55:32    [junit4] Completed on J3 in 0.12s, 4 tests
06-Feb-2014 10:55:32    [junit4]
06-Feb-2014 10:55:33    [junit4] Suite: org.carrot2.text.preprocessing.filter.CompleteLabelFilterTest
06-Feb-2014 10:55:33    [junit4] Completed on J2 in 0.25s, 7 tests
06-Feb-2014 10:55:33    [junit4]
06-Feb-2014 10:55:33    [junit4] Suite: org.carrot2.util.RangeUtilsTest
06-Feb-2014 10:55:33    [junit4] Completed on J3 in 0.15s, 10 tests
06-Feb-2014 10:55:33    [junit4]
06-Feb-2014 10:55:33    [junit4] Suite: org.carrot2.source.google.GoogleDocumentSourceTest
06-Feb-2014 10:55:33    [junit4] IGNOR/A 0.00s J1 | GoogleDocumentSourceTest.testSmallQuery
06-Feb-2014 10:55:33    [junit4]    > Assumption #1: 'usesexternalservices' test group is disabled (@UsesExternalServices)
06-Feb-2014 10:55:33    [junit4] IGNOR/A 0.05s J1 | GoogleDocumentSourceTest.testHtmlUnescaping
06-Feb-2014 10:55:33    [junit4]    > Assumption #1: 'usesexternalservices' test group is disabled (@UsesExternalServices)
06-Feb-2014 10:55:33    [junit4] IGNOR/A 0.00s J1 | GoogleDocumentSourceTest.testSpeculativeMode
06-Feb-2014 10:55:33    [junit4]    > Assumption #1: 'usesexternalservices' test group is disabled (@UsesExternalServices)
06-Feb-2014 10:55:33    [junit4] IGNOR/A 0.00s J1 | GoogleDocumentSourceTest.testNoUrlEncodingInUrls
06-Feb-2014 10:55:33    [junit4]    > Assumption #1: 'usesexternalservices' test group is disabled (@UsesExternalServices)
06-Feb-2014 10:55:33    [junit4] IGNOR/A 0.00s J1 | GoogleDocumentSourceTest.testNoResultsQuery
06-Feb-2014 10:55:33    [junit4]    > Assumption #1: 'usesexternalservices' test group is disabled (@UsesExternalServices)
06-Feb-2014 10:55:33    [junit4] IGNOR/A 0.00s J1 | GoogleDocumentSourceTest.testLargeQuery
06-Feb-2014 10:55:33    [junit4]    > Assumption #1: 'usesexternalservices' test group is disabled (@UsesExternalServices)
06-Feb-2014 10:55:33    [junit4] IGNOR/A 0.00s J1 | GoogleDocumentSourceTest.testURLsUnique
06-Feb-2014 10:55:33    [junit4]    > Assumption #1: 'usesexternalservices' test group is disabled (@UsesExternalServices)
06-Feb-2014 10:55:33    [junit4] IGNOR/A 0.02s J1 | GoogleDocumentSourceTest.testInCachingController
06-Feb-2014 10:55:33    [junit4]    > Assumption #1: 'usesexternalservices' test group is disabled (@UsesExternalServices)
06-Feb-2014 10:55:33    [junit4] IGNOR/A 0.01s J1 | GoogleDocumentSourceTest.testMetadataAvailable
06-Feb-2014 10:55:33    [junit4]    > Assumption #1: 'usesexternalservices' test group is disabled (@UsesExternalServices)
06-Feb-2014 10:55:33    [junit4] IGNOR/A 0.02s J1 | GoogleDocumentSourceTest.testHighlightsRemoved
06-Feb-2014 10:55:33    [junit4]    > Assumption #1: 'usesexternalservices' test group is disabled (@UsesExternalServices)
06-Feb-2014 10:55:33    [junit4] IGNOR/A 0.01s J1 | GoogleDocumentSourceTest.testResultsTotal
06-Feb-2014 10:55:33    [junit4]    > Assumption #1: 'usesexternalservices' test group is disabled (@UsesExternalServices)
06-Feb-2014 10:55:33    [junit4] IGNOR/A 0.00s J1 | GoogleDocumentSourceTest.testConservativeMode
06-Feb-2014 10:55:33    [junit4]    > Assumption #1: 'usesexternalservices' test group is disabled (@UsesExternalServices)
06-Feb-2014 10:55:33    [junit4] IGNOR/A 0.03s J1 | GoogleDocumentSourceTest.testUtfCharacters
06-Feb-2014 10:55:33    [junit4]    > Assumption #1: 'usesexternalservices' test group is disabled (@UsesExternalServices)
06-Feb-2014 10:55:33    [junit4] IGNOR/A 0.00s J1 | GoogleDocumentSourceTest.testQueryLargerThanPage
06-Feb-2014 10:55:33    [junit4]    > Assumption #1: 'usesexternalservices' test group is disabled (@UsesExternalServices)
06-Feb-2014 10:55:33    [junit4] Completed on J1 in 0.26s, 14 tests, 14 skipped
06-Feb-2014 10:55:33    [junit4]
06-Feb-2014 10:55:33    [junit4] Suite: org.carrot2.text.preprocessing.filter.GenitiveLabelFilterTest
06-Feb-2014 10:55:33    [junit4] Completed on J2 in 0.11s, 5 tests
06-Feb-2014 10:55:33    [junit4]
06-Feb-2014 10:55:33    [junit4] Suite: org.carrot2.text.linguistic.LanguageModelTest
06-Feb-2014 10:55:33    [junit4] Completed on J3 in 0.07s, 2 tests
06-Feb-2014 10:55:33    [junit4]
06-Feb-2014 10:55:47    [junit4] Suite: org.carrot2.source.pubmed.PubMedIdSearchHandlerTest
06-Feb-2014 10:55:47    [junit4] ERROR   30.5s J0 | PubMedIdSearchHandlerTest.testIdHandler <<<
06-Feb-2014 10:55:47    [junit4]    > Throwable #1: java.io.IOException: Server returned HTTP response code: 503 for URL: http://www.ncbi.nlm.nih.gov/entrez/query/DTD/eSearch_020511.dtd
06-Feb-2014 10:55:47    [junit4]    >         at __randomizedtesting.SeedInfo.seed([7DA2C1A8A7F1FABB:3E4DA094574FC8BD]:0)
06-Feb-2014 10:55:47    [junit4]    >         at sun.net.www.protocol.http.HttpURLConnection.getInputStream(HttpURLConnection.java:1403)
06-Feb-2014 10:55:47    [junit4]    >         at org.apache.xerces.impl.XMLEntityManager.setupCurrentEntity(Unknown Source)
06-Feb-2014 10:55:47    [junit4]    >         at org.apache.xerces.impl.XMLEntityManager.startEntity(Unknown Source)
06-Feb-2014 10:55:47    [junit4]    >         at org.apache.xerces.impl.XMLEntityManager.startDTDEntity(Unknown Source)
06-Feb-2014 10:55:47    [junit4]    >         at org.apache.xerces.impl.XMLDTDScannerImpl.setInputSource(Unknown Source)
06-Feb-2014 10:55:47    [junit4]    >         at org.apache.xerces.impl.XMLDocumentScannerImpl$DTDDispatcher.dispatch(Unknown Source)
06-Feb-2014 10:55:47    [junit4]    >         at org.apache.xerces.impl.XMLDocumentFragmentScannerImpl.scanDocument(Unknown Source)
06-Feb-2014 10:55:47    [junit4]    >         at org.apache.xerces.parsers.XML11Configuration.parse(Unknown Source)
06-Feb-2014 10:55:47    [junit4]    >         at org.apache.xerces.parsers.XML11Configuration.parse(Unknown Source)
06-Feb-2014 10:55:47    [junit4]    >         at org.apache.xerces.parsers.XMLParser.parse(Unknown Source)
06-Feb-2014 10:55:47    [junit4]    >         at org.apache.xerces.parsers.AbstractSAXParser.parse(Unknown Source)
06-Feb-2014 10:55:47    [junit4]    >         at org.apache.xerces.jaxp.SAXParserImpl$JAXPSAXParser.parse(Unknown Source)
06-Feb-2014 10:55:47    [junit4]    >         at org.carrot2.source.pubmed.PubMedIdSearchHandlerTest.testIdHandler(PubMedIdSearchHandlerTest.java:182)
06-Feb-2014 10:55:47    [junit4]    >         at sun.reflect.NativeMethodAccessorImpl.invoke0(Native Method)
06-Feb-2014 10:55:47    [junit4]    >         at sun.reflect.NativeMethodAccessorImpl.invoke(NativeMethodAccessorImpl.java:57)
06-Feb-2014 10:55:47    [junit4]    >         at sun.reflect.DelegatingMethodAccessorImpl.invoke(DelegatingMethodAccessorImpl.java:43)
06-Feb-2014 10:55:47    [junit4]    >         at java.lang.reflect.Method.invoke(Method.java:622)
06-Feb-2014 10:55:47    [junit4]    >         at com.carrotsearch.randomizedtesting.RandomizedRunner.invoke(RandomizedRunner.java:1559)
06-Feb-2014 10:55:47    [junit4]    >         at com.carrotsearch.randomizedtesting.RandomizedRunner.access$600(RandomizedRunner.java:79)
06-Feb-2014 10:55:47    [junit4]    >         at com.carrotsearch.randomizedtesting.RandomizedRunner$6.evaluate(RandomizedRunner.java:737)
06-Feb-2014 10:55:47    [junit4]    >         at com.carrotsearch.randomizedtesting.rules.SystemPropertiesInvariantRule$1.evaluate(SystemPropertiesInvariantRule.java:55)
06-Feb-2014 10:55:47    [junit4]    >         at com.carrotsearch.randomizedtesting.rules.StatementAdapter.evaluate(StatementAdapter.java:36)
06-Feb-2014 10:55:47    [junit4]    >         at com.carrotsearch.randomizedtesting.ThreadLeakControl$StatementRunner.run(ThreadLeakControl.java:358)
06-Feb-2014 10:55:47    [junit4]    >         at com.carrotsearch.randomizedtesting.ThreadLeakControl.forkTimeoutingTask(ThreadLeakControl.java:782)
06-Feb-2014 10:55:47    [junit4]    >         at com.carrotsearch.randomizedtesting.ThreadLeakControl$3.evaluate(ThreadLeakControl.java:442)
06-Feb-2014 10:55:47    [junit4]    >         at com.carrotsearch.randomizedtesting.RandomizedRunner.runSingleTest(RandomizedRunner.java:746)
06-Feb-2014 10:55:47    [junit4]    >         at com.carrotsearch.randomizedtesting.RandomizedRunner$3.evaluate(RandomizedRunner.java:648)
06-Feb-2014 10:55:47    [junit4]    >         at com.carrotsearch.randomizedtesting.RandomizedRunner$4.evaluate(RandomizedRunner.java:682)
06-Feb-2014 10:55:47    [junit4]    >         at com.carrotsearch.randomizedtesting.RandomizedRunner$5.evaluate(RandomizedRunner.java:693)
06-Feb-2014 10:55:47    [junit4]    >         at com.carrotsearch.randomizedtesting.rules.NoShadowingOrOverridesOnMethodsRule$1.evaluate(NoShadowingOrOverridesOnMethodsRule.java:39)
06-Feb-2014 10:55:47    [junit4]    >         at com.carrotsearch.randomizedtesting.rules.NoShadowingOrOverridesOnMethodsRule$1.evaluate(NoShadowingOrOverridesOnMethodsRule.java:39)
06-Feb-2014 10:55:47    [junit4]    >         at com.carrotsearch.randomizedtesting.rules.StatementAdapter.evaluate(StatementAdapter.java:36)
06-Feb-2014 10:55:47    [junit4]    >         at com.carrotsearch.randomizedtesting.rules.SystemPropertiesInvariantRule$1.evaluate(SystemPropertiesInvariantRule.java:55)
06-Feb-2014 10:55:47    [junit4]    >         at com.carrotsearch.randomizedtesting.rules.StatementAdapter.evaluate(StatementAdapter.java:36)
06-Feb-2014 10:55:47    [junit4]    >         at com.carrotsearch.randomizedtesting.ThreadLeakControl$StatementRunner.run(ThreadLeakControl.java:358)
06-Feb-2014 10:55:47    [junit4]    >         at java.lang.Thread.run(Thread.java:701)
06-Feb-2014 10:55:47    [junit4] Completed on J0 in 30.54s, 1 test, 1 error <<< FAILURES!
06-Feb-2014 10:55:47    [junit4]
06-Feb-2014 10:55:47    [junit4] Suite: org.carrot2.clustering.lingo.ClusterDocumentAssignerTest
06-Feb-2014 10:55:47    [junit4] Completed on J0 in 0.07s, 4 tests
06-Feb-2014 10:55:47    [junit4]
06-Feb-2014 10:55:47    [junit4] Suite: org.carrot2.text.preprocessing.SubstringComparatorTest
06-Feb-2014 10:55:47    [junit4] Completed on J0 in 0.03s, 2 tests
06-Feb-2014 10:55:47    [junit4]
06-Feb-2014 10:55:50    [junit4] Suite: org.carrot2.core.ControllerTest
06-Feb-2014 10:55:50    [junit4] IGNOR/A 0.00s J0 | ControllerTest$SimpleControllerCommonTests.testNormalExecutionTimeMeasurement
06-Feb-2014 10:55:50    [junit4]    > Assumption #1: 'nightly' test group is disabled (@Nightly)
06-Feb-2014 10:55:50    [junit4] IGNOR/A 0.00s J0 | ControllerTest$SimpleControllerCommonTests.testStress
06-Feb-2014 10:55:50    [junit4]    > Assumption #1: 'nightly' test group is disabled (@Nightly)
06-Feb-2014 10:55:50    [junit4] IGNOR/A 0.00s J0 | ControllerTest$PoolingControllerCommonTests.testNormalExecutionTimeMeasurement
06-Feb-2014 10:55:50    [junit4]    > Assumption #1: 'nightly' test group is disabled (@Nightly)
06-Feb-2014 10:55:50    [junit4] IGNOR/A 0.00s J0 | ControllerTest$PoolingControllerCommonTests.testStress
06-Feb-2014 10:55:50    [junit4]    > Assumption #1: 'nightly' test group is disabled (@Nightly)
06-Feb-2014 10:55:50    [junit4] IGNOR/A 0.00s J0 | ControllerTest$CachingPoolingControllerCachingOffCommonTests.testNormalExecutionTimeMeasurement
06-Feb-2014 10:55:50    [junit4]    > Assumption #1: 'nightly' test group is disabled (@Nightly)
06-Feb-2014 10:55:50    [junit4] IGNOR/A 0.00s J0 | ControllerTest$CachingPoolingControllerCachingOffCommonTests.testStress
06-Feb-2014 10:55:50    [junit4]    > Assumption #1: 'nightly' test group is disabled (@Nightly)
06-Feb-2014 10:55:50    [junit4] IGNOR/A 0.00s J0 | ControllerTest$CachingPoolingControllerCachingOnCommonTests.testNormalExecutionTimeMeasurement
06-Feb-2014 10:55:50    [junit4]    > Assumption #1: 'nightly' test group is disabled (@Nightly)
06-Feb-2014 10:55:50    [junit4] IGNOR/A 0.00s J0 | ControllerTest$CachingPoolingControllerCachingOnCommonTests.testStress
06-Feb-2014 10:55:50    [junit4]    > Assumption #1: 'nightly' test group is disabled (@Nightly)
06-Feb-2014 10:55:50    [junit4] IGNOR/A 0.00s J0 | ControllerTest$CachingControllerCachingOffCommonTests.testNormalExecutionTimeMeasurement
06-Feb-2014 10:55:50    [junit4]    > Assumption #1: 'nightly' test group is disabled (@Nightly)
06-Feb-2014 10:55:50    [junit4] IGNOR/A 0.00s J0 | ControllerTest$CachingControllerCachingOffCommonTests.testStress
06-Feb-2014 10:55:50    [junit4]    > Assumption #1: 'nightly' test group is disabled (@Nightly)
06-Feb-2014 10:55:50    [junit4] IGNOR/A 0.00s J0 | ControllerTest$CachingControllerCachingOnCommonTests.testNormalExecutionTimeMeasurement
06-Feb-2014 10:55:50    [junit4]    > Assumption #1: 'nightly' test group is disabled (@Nightly)
06-Feb-2014 10:55:50    [junit4] IGNOR/A 0.00s J0 | ControllerTest$CachingControllerCachingOnCommonTests.testStress
06-Feb-2014 10:55:50    [junit4]    > Assumption #1: 'nightly' test group is disabled (@Nightly)
06-Feb-2014 10:55:50    [junit4] Completed on J0 in 2.32s, 201 tests, 14 skipped
06-Feb-2014 10:55:50    [junit4]
06-Feb-2014 10:55:50    [junit4] Suite: org.carrot2.util.attribute.AttributeValueSetTest
06-Feb-2014 10:55:50    [junit4] Completed on J0 in 0.01s, 3 tests
06-Feb-2014 10:55:50    [junit4]
06-Feb-2014 10:55:50    [junit4]
06-Feb-2014 10:55:50    [junit4] Tests with failures:
06-Feb-2014 10:55:50    [junit4]   - org.carrot2.source.pubmed.PubMedIdSearchHandlerTest.testIdHandler
06-Feb-2014 10:55:50    [junit4]
06-Feb-2014 10:55:50    [junit4]
06-Feb-2014 10:55:50    [junit4] JVM J0:     1.01 ..    41.40 =    40.38s
06-Feb-2014 10:55:50    [junit4] JVM J1:     1.27 ..    24.65 =    23.38s
06-Feb-2014 10:55:50    [junit4] JVM J2:     1.16 ..    24.65 =    23.49s
06-Feb-2014 10:55:50    [junit4] JVM J3:     1.01 ..    24.66 =    23.64s
06-Feb-2014 10:55:50    [junit4] Execution time total: 41 seconds
06-Feb-2014 10:55:50    [junit4] Tests summary: 97 suites, 919 tests, 1 error, 119 ignored (114 assumptions)
06-Feb-2014 10:55:50
06-Feb-2014 10:55:50 BUILD FAILED
06-Feb-2014 10:55:50 /mnt/work/bamboo-home/xml-data/build-dir/C2-SOFTWARE0-JDK16/build.xml:531: Tests failed. See /mnt/work/bamboo-home/xml-data/build-dir/C2-SOFTWARE0-JDK16/tmp/test-report for report.
06-Feb-2014 10:55:50
06-Feb-2014 10:55:50 Total time: 56 seconds
06-Feb-2014 10:55:50 Failing task since return code of [/usr/share/ant/bin/ant -Djava.io.tmpdir=/home/bamboo/bamboo-software/temp/C2-SOFTWARE0-JDK16 clean test] was 1 while expected 0
06-Feb-2014 10:55:50 Parsing test results...
06-Feb-2014 10:55:50 Finished task 'Ant'
06-Feb-2014 10:55:50 Running post build plugin 'NCover Results Collector'
06-Feb-2014 10:55:50 Running post build plugin 'Clover Results Collector'
06-Feb-2014 10:55:50 Running post build plugin 'Artifact Copier'
06-Feb-2014 10:55:50 Finalising the build...
06-Feb-2014 10:55:50 Stopping timer.
06-Feb-2014 10:55:50 Build C2-SOFTWARE0-JDK16-8 completed.
06-Feb-2014 10:55:50 Running on server: post build plugin 'NCover Results Collector'
06-Feb-2014 10:55:50 Running on server: post build plugin 'Clover Delta Calculator'
06-Feb-2014 10:55:50 Running on server: post build plugin 'Build Hanging Detection Configuration'
06-Feb-2014 10:55:50 Running on server: post build plugin 'Maven Dependencies Postprocessor'
06-Feb-2014 10:55:50 All post build plugins have finished
06-Feb-2014 10:55:50 Generating build results summary...
06-Feb-2014 10:55:50 Saving build results to disk...
06-Feb-2014 10:55:50 Indexing build results...
06-Feb-2014 10:55:50 Finished building C2-SOFTWARE0-JDK16-8.