Build #8

Build: #8 failed Changes by Stanislaw Osinski

Logs

The following logs have been generated by the jobs in this branch.
  • Expand all
  • Collapse all
Job Logs
Collapse JDK 1.6 Compile and test Download or View
06-Feb-2014 10:55:50    [junit4] IGNOR/A 0.00s J0 | ControllerTest$CachingControllerCachingOnCommonTests.testNormalExecutionTimeMeasurement
06-Feb-2014 10:55:50    [junit4]    > Assumption #1: 'nightly' test group is disabled (@Nightly)
06-Feb-2014 10:55:50    [junit4] IGNOR/A 0.00s J0 | ControllerTest$CachingControllerCachingOnCommonTests.testStress
06-Feb-2014 10:55:50    [junit4]    > Assumption #1: 'nightly' test group is disabled (@Nightly)
06-Feb-2014 10:55:50    [junit4] Completed on J0 in 2.32s, 201 tests, 14 skipped
06-Feb-2014 10:55:50    [junit4]
06-Feb-2014 10:55:50    [junit4] Suite: org.carrot2.util.attribute.AttributeValueSetTest
06-Feb-2014 10:55:50    [junit4] Completed on J0 in 0.01s, 3 tests
06-Feb-2014 10:55:50    [junit4]
06-Feb-2014 10:55:50    [junit4]
06-Feb-2014 10:55:50    [junit4] Tests with failures:
06-Feb-2014 10:55:50    [junit4]   - org.carrot2.source.pubmed.PubMedIdSearchHandlerTest.testIdHandler
06-Feb-2014 10:55:50    [junit4]
06-Feb-2014 10:55:50    [junit4]
06-Feb-2014 10:55:50    [junit4] JVM J0:     1.01 ..    41.40 =    40.38s
06-Feb-2014 10:55:50    [junit4] JVM J1:     1.27 ..    24.65 =    23.38s
06-Feb-2014 10:55:50    [junit4] JVM J2:     1.16 ..    24.65 =    23.49s
06-Feb-2014 10:55:50    [junit4] JVM J3:     1.01 ..    24.66 =    23.64s
06-Feb-2014 10:55:50    [junit4] Execution time total: 41 seconds
06-Feb-2014 10:55:50    [junit4] Tests summary: 97 suites, 919 tests, 1 error, 119 ignored (114 assumptions)
06-Feb-2014 10:55:50
06-Feb-2014 10:55:50 BUILD FAILED
06-Feb-2014 10:55:50 /mnt/work/bamboo-home/xml-data/build-dir/C2-SOFTWARE0-JDK16/build.xml:531: Tests failed. See /mnt/work/bamboo-home/xml-data/build-dir/C2-SOFTWARE0-JDK16/tmp/test-report for report.
06-Feb-2014 10:55:50
06-Feb-2014 10:55:50 Total time: 56 seconds
Collapse JDK 1.8 Compile and test Download or View
06-Feb-2014 10:56:13    [junit4]    >         at com.carrotsearch.randomizedtesting.rules.NoShadowingOrOverridesOnMethodsRule$1.evaluate(NoShadowingOrOverridesOnMethodsRule.java:39)
06-Feb-2014 10:56:13    [junit4]    >         at com.carrotsearch.randomizedtesting.rules.NoShadowingOrOverridesOnMethodsRule$1.evaluate(NoShadowingOrOverridesOnMethodsRule.java:39)
06-Feb-2014 10:56:13    [junit4]    >         at com.carrotsearch.randomizedtesting.rules.StatementAdapter.evaluate(StatementAdapter.java:36)
06-Feb-2014 10:56:13    [junit4]    >         at com.carrotsearch.randomizedtesting.rules.SystemPropertiesInvariantRule$1.evaluate(SystemPropertiesInvariantRule.java:55)
06-Feb-2014 10:56:13    [junit4]    >         at com.carrotsearch.randomizedtesting.rules.StatementAdapter.evaluate(StatementAdapter.java:36)
06-Feb-2014 10:56:13    [junit4]    >         at com.carrotsearch.randomizedtesting.ThreadLeakControl$StatementRunner.run(ThreadLeakControl.java:358)
06-Feb-2014 10:56:13    [junit4]    >         at java.lang.Thread.run(Thread.java:744)
06-Feb-2014 10:56:13    [junit4] Completed on J2 in 30.60s, 1 test, 1 error <<< FAILURES!
06-Feb-2014 10:56:13    [junit4]
06-Feb-2014 10:56:13    [junit4]
06-Feb-2014 10:56:13    [junit4] Tests with failures:
06-Feb-2014 10:56:13    [junit4]   - org.carrot2.source.pubmed.PubMedIdSearchHandlerTest.testIdHandler
06-Feb-2014 10:56:13    [junit4]
06-Feb-2014 10:56:13    [junit4]
06-Feb-2014 10:56:13
06-Feb-2014 10:56:13 BUILD FAILED
06-Feb-2014 10:56:13 E:\xml-data\build-dir\C2-SOFTWARE0-JDK18\build.xml:531: Tests failed. See E:\xml-data\build-dir\C2-SOFTWARE0-JDK18\tmp\test-report for report.
06-Feb-2014 10:56:13
06-Feb-2014 10:56:13 Total time: 1 minute 24 seconds
06-Feb-2014 10:56:13    [junit4] JVM J0:     2.15 ..    25.82 =    23.66s
06-Feb-2014 10:56:13    [junit4] JVM J1:     3.09 ..    24.35 =    21.26s
06-Feb-2014 10:56:13    [junit4] JVM J2:     3.36 ..    55.39 =    52.03s
06-Feb-2014 10:56:13    [junit4] JVM J3:     2.09 ..    24.86 =    22.77s
06-Feb-2014 10:56:13    [junit4] Execution time total: 55 seconds
06-Feb-2014 10:56:13    [junit4] Tests summary: 97 suites, 919 tests, 1 error, 119 ignored (114 assumptions)