Build #298

Build: #298 failed

Job: JDK 1.7 failed

Stages & jobs

  1. Compile and test

  2. Package

  3. Upload

Build log

The build generated 3,464 lines of output.The output is too long and has been truncated to the last 1,000 lines. Download or view full build log

20-Sep-2019 11:00:37    [junit4]    >         at com.carrotsearch.randomizedtesting.RandomizedRunner$5.evaluate(RandomizedRunner.java:802)
20-Sep-2019 11:00:37    [junit4]    >         at com.carrotsearch.randomizedtesting.RandomizedRunner$6.evaluate(RandomizedRunner.java:852)
20-Sep-2019 11:00:37    [junit4]    >         at com.carrotsearch.randomizedtesting.RandomizedRunner$7.evaluate(RandomizedRunner.java:863)
20-Sep-2019 11:00:37    [junit4]    >         at com.carrotsearch.randomizedtesting.rules.NoShadowingOrOverridesOnMethodsRule$1.evaluate(NoShadowingOrOverridesOnMethodsRule.java:40)
20-Sep-2019 11:00:37    [junit4]    >         at com.carrotsearch.randomizedtesting.rules.NoShadowingOrOverridesOnMethodsRule$1.evaluate(NoShadowingOrOverridesOnMethodsRule.java:40)
20-Sep-2019 11:00:37    [junit4]    >         at com.carrotsearch.randomizedtesting.rules.SystemPropertiesInvariantRule$1.evaluate(SystemPropertiesInvariantRule.java:59)
20-Sep-2019 11:00:37    [junit4]    >         at com.carrotsearch.randomizedtesting.rules.StatementAdapter.evaluate(StatementAdapter.java:36)
20-Sep-2019 11:00:37    [junit4]    >         at com.carrotsearch.randomizedtesting.ThreadLeakControl$StatementRunner.run(ThreadLeakControl.java:367)
20-Sep-2019 11:00:37    [junit4]    >         at java.lang.Thread.run(Thread.java:745)
20-Sep-2019 11:00:37    [junit4] IGNOR/A 0.00s J2 | LuceneDocumentSourceTest.testSmallQuery
20-Sep-2019 11:00:37    [junit4]    > Assumption #1: 'usesexternalservices' test group is disabled (@UsesExternalServices())
20-Sep-2019 11:00:37    [junit4] IGNOR/A 0.00s J2 | LuceneDocumentSourceTest.testInCachingController
20-Sep-2019 11:00:37    [junit4]    > Assumption #1: 'usesexternalservices' test group is disabled (@UsesExternalServices())
20-Sep-2019 11:00:37    [junit4] IGNOR/A 0.00s J2 | LuceneDocumentSourceTest.testResultsTotal
20-Sep-2019 11:00:37    [junit4]    > Assumption #1: 'usesexternalservices' test group is disabled (@UsesExternalServices())
20-Sep-2019 11:00:37    [junit4] Completed [41/95 (6!)] on J2 in 1.16s, 18 tests, 1 error, 8 skipped <<< FAILURES!
20-Sep-2019 11:00:37    [junit4]
20-Sep-2019 11:00:37    [junit4] Suite: org.carrot2.text.preprocessing.TokenizerTest
20-Sep-2019 11:00:37    [junit4] Completed [42/95 (6!)] on J0 in 0.03s, 8 tests
20-Sep-2019 11:00:37    [junit4]
20-Sep-2019 11:00:38    [junit4] Suite: org.carrot2.clustering.synthetic.ByUrlClusteringAlgorithmTest
20-Sep-2019 11:00:38    [junit4] IGNOR/A 0.00s J0 | ByUrlClusteringAlgorithmTest.testStress
20-Sep-2019 11:00:38    [junit4]    > Assumption #1: 'nightly' test group is disabled (@Nightly(value=))
20-Sep-2019 11:00:38    [junit4] Completed [43/95 (6!)] on J0 in 0.08s, 11 tests, 1 skipped
20-Sep-2019 11:00:38    [junit4]
20-Sep-2019 11:00:38    [junit4] Suite: org.carrot2.text.preprocessing.PhraseExtractorTest
20-Sep-2019 11:00:38    [junit4] Completed [44/95 (6!)] on J1 in 1.23s, 21 tests
20-Sep-2019 11:00:38    [junit4]
20-Sep-2019 11:00:38    [junit4] Suite: org.carrot2.text.vsm.PhraseMatrixBuilderTest
20-Sep-2019 11:00:38    [junit4] Completed [45/95 (6!)] on J1 in 0.03s, 6 tests
20-Sep-2019 11:00:38    [junit4]
20-Sep-2019 11:00:38    [junit4] Suite: org.carrot2.clustering.stc.GeneralizedSuffixTreeTest
20-Sep-2019 11:00:38    [junit4] Completed [46/95 (6!)] on J1 in 0.02s, 3 tests
20-Sep-2019 11:00:38    [junit4]
20-Sep-2019 11:00:38    [junit4] Suite: org.carrot2.core.ProcessingResultTest
20-Sep-2019 11:00:38    [junit4] ERROR   0.00s J1 | ProcessingResultTest.testNoFalseJunkGroupAttribute <<<
20-Sep-2019 11:00:38    [junit4]    > Throwable #1: java.lang.UnsupportedClassVersionError: org/simpleframework/xml/core/Persister : Unsupported major.minor version 52.0
20-Sep-2019 11:00:38    [junit4]    >         at __randomizedtesting.SeedInfo.seed([D0B241FC88C4131E:F447EEBA5E4488E8]:0)
20-Sep-2019 11:00:38    [junit4]    >         at java.lang.ClassLoader.defineClass1(Native Method)
20-Sep-2019 11:00:38    [junit4]    >         at java.lang.ClassLoader.defineClass(ClassLoader.java:800)
20-Sep-2019 11:00:38    [junit4]    >         at java.security.SecureClassLoader.defineClass(SecureClassLoader.java:142)
20-Sep-2019 11:00:38    [junit4]    >         at java.net.URLClassLoader.defineClass(URLClassLoader.java:449)
20-Sep-2019 11:00:38    [junit4]    >         at java.net.URLClassLoader.access$100(URLClassLoader.java:71)
20-Sep-2019 11:00:38    [junit4]    >         at java.net.URLClassLoader$1.run(URLClassLoader.java:361)
20-Sep-2019 11:00:38    [junit4]    >         at java.net.URLClassLoader$1.run(URLClassLoader.java:355)
20-Sep-2019 11:00:38    [junit4]    >         at java.security.AccessController.doPrivileged(Native Method)
20-Sep-2019 11:00:38    [junit4]    >         at java.net.URLClassLoader.findClass(URLClassLoader.java:354)
20-Sep-2019 11:00:38    [junit4]    >         at java.lang.ClassLoader.loadClass(ClassLoader.java:425)
20-Sep-2019 11:00:38    [junit4]    >         at sun.misc.Launcher$AppClassLoader.loadClass(Launcher.java:308)
20-Sep-2019 11:00:38    [junit4]    >         at java.lang.ClassLoader.loadClass(ClassLoader.java:358)
20-Sep-2019 11:00:38    [junit4]    >         at org.carrot2.core.ProcessingResult.serialize(ProcessingResult.java:277)
20-Sep-2019 11:00:38    [junit4]    >         at org.carrot2.core.ProcessingResultTest.testNoFalseJunkGroupAttribute(ProcessingResultTest.java:340)
20-Sep-2019 11:00:38    [junit4]    >         at sun.reflect.NativeMethodAccessorImpl.invoke0(Native Method)
20-Sep-2019 11:00:38    [junit4]    >         at sun.reflect.NativeMethodAccessorImpl.invoke(NativeMethodAccessorImpl.java:57)
20-Sep-2019 11:00:38    [junit4]    >         at sun.reflect.DelegatingMethodAccessorImpl.invoke(DelegatingMethodAccessorImpl.java:43)
20-Sep-2019 11:00:38    [junit4]    >         at java.lang.reflect.Method.invoke(Method.java:606)
20-Sep-2019 11:00:38    [junit4]    >         at com.carrotsearch.randomizedtesting.RandomizedRunner.invoke(RandomizedRunner.java:1713)
20-Sep-2019 11:00:38    [junit4]    >         at com.carrotsearch.randomizedtesting.RandomizedRunner$8.evaluate(RandomizedRunner.java:907)
20-Sep-2019 11:00:38    [junit4]    >         at com.carrotsearch.randomizedtesting.rules.SystemPropertiesInvariantRule$1.evaluate(SystemPropertiesInvariantRule.java:59)
20-Sep-2019 11:00:38    [junit4]    >         at com.carrotsearch.randomizedtesting.rules.StatementAdapter.evaluate(StatementAdapter.java:36)
20-Sep-2019 11:00:38    [junit4]    >         at com.carrotsearch.randomizedtesting.ThreadLeakControl$StatementRunner.run(ThreadLeakControl.java:367)
20-Sep-2019 11:00:38    [junit4]    >         at com.carrotsearch.randomizedtesting.ThreadLeakControl.forkTimeoutingTask(ThreadLeakControl.java:811)
20-Sep-2019 11:00:38    [junit4]    >         at com.carrotsearch.randomizedtesting.ThreadLeakControl$3.evaluate(ThreadLeakControl.java:462)
20-Sep-2019 11:00:38    [junit4]    >         at com.carrotsearch.randomizedtesting.RandomizedRunner.runSingleTest(RandomizedRunner.java:916)
20-Sep-2019 11:00:38    [junit4]    >         at com.carrotsearch.randomizedtesting.RandomizedRunner$5.evaluate(RandomizedRunner.java:802)
20-Sep-2019 11:00:38    [junit4]    >         at com.carrotsearch.randomizedtesting.RandomizedRunner$6.evaluate(RandomizedRunner.java:852)
20-Sep-2019 11:00:38    [junit4]    >         at com.carrotsearch.randomizedtesting.RandomizedRunner$7.evaluate(RandomizedRunner.java:863)
20-Sep-2019 11:00:38    [junit4]    >         at com.carrotsearch.randomizedtesting.rules.NoShadowingOrOverridesOnMethodsRule$1.evaluate(NoShadowingOrOverridesOnMethodsRule.java:40)
20-Sep-2019 11:00:38    [junit4]    >         at com.carrotsearch.randomizedtesting.rules.NoShadowingOrOverridesOnMethodsRule$1.evaluate(NoShadowingOrOverridesOnMethodsRule.java:40)
20-Sep-2019 11:00:38    [junit4]    >         at com.carrotsearch.randomizedtesting.rules.SystemPropertiesInvariantRule$1.evaluate(SystemPropertiesInvariantRule.java:59)
20-Sep-2019 11:00:38    [junit4]    >         at com.carrotsearch.randomizedtesting.rules.StatementAdapter.evaluate(StatementAdapter.java:36)
20-Sep-2019 11:00:38    [junit4]    >         at com.carrotsearch.randomizedtesting.ThreadLeakControl$StatementRunner.run(ThreadLeakControl.java:367)
20-Sep-2019 11:00:38    [junit4]    >         at java.lang.Thread.run(Thread.java:745)
20-Sep-2019 11:00:38    [junit4] ERROR   0.00s J1 | ProcessingResultTest.testClusterDeserializationFromLegacyXml <<<
20-Sep-2019 11:00:38    [junit4]    > Throwable #1: java.lang.UnsupportedClassVersionError: org/simpleframework/xml/core/Persister
20-Sep-2019 11:00:38    [junit4]    >         at __randomizedtesting.SeedInfo.seed([D0B241FC88C4131E:ADB75649C58D0A7A]:0)
20-Sep-2019 11:00:38    [junit4]    >         at org.carrot2.core.ProcessingResult.deserialize(ProcessingResult.java:372)
20-Sep-2019 11:00:38    [junit4]    >         at org.carrot2.core.ProcessingResultTest.testClusterDeserializationFromLegacyXml(ProcessingResultTest.java:214)
20-Sep-2019 11:00:38    [junit4]    >         at sun.reflect.NativeMethodAccessorImpl.invoke0(Native Method)
20-Sep-2019 11:00:38    [junit4]    >         at sun.reflect.NativeMethodAccessorImpl.invoke(NativeMethodAccessorImpl.java:57)
20-Sep-2019 11:00:38    [junit4]    >         at sun.reflect.DelegatingMethodAccessorImpl.invoke(DelegatingMethodAccessorImpl.java:43)
20-Sep-2019 11:00:38    [junit4]    >         at java.lang.reflect.Method.invoke(Method.java:606)
20-Sep-2019 11:00:38    [junit4]    >         at com.carrotsearch.randomizedtesting.RandomizedRunner.invoke(RandomizedRunner.java:1713)
20-Sep-2019 11:00:38    [junit4]    >         at com.carrotsearch.randomizedtesting.RandomizedRunner$8.evaluate(RandomizedRunner.java:907)
20-Sep-2019 11:00:38    [junit4]    >         at com.carrotsearch.randomizedtesting.rules.SystemPropertiesInvariantRule$1.evaluate(SystemPropertiesInvariantRule.java:59)
20-Sep-2019 11:00:38    [junit4]    >         at com.carrotsearch.randomizedtesting.rules.StatementAdapter.evaluate(StatementAdapter.java:36)
20-Sep-2019 11:00:38    [junit4]    >         at com.carrotsearch.randomizedtesting.ThreadLeakControl$StatementRunner.run(ThreadLeakControl.java:367)
20-Sep-2019 11:00:38    [junit4]    >         at com.carrotsearch.randomizedtesting.ThreadLeakControl.forkTimeoutingTask(ThreadLeakControl.java:811)
20-Sep-2019 11:00:38    [junit4]    >         at com.carrotsearch.randomizedtesting.ThreadLeakControl$3.evaluate(ThreadLeakControl.java:462)
20-Sep-2019 11:00:38    [junit4]    >         at com.carrotsearch.randomizedtesting.RandomizedRunner.runSingleTest(RandomizedRunner.java:916)
20-Sep-2019 11:00:38    [junit4]    >         at com.carrotsearch.randomizedtesting.RandomizedRunner$5.evaluate(RandomizedRunner.java:802)
20-Sep-2019 11:00:38    [junit4]    >         at com.carrotsearch.randomizedtesting.RandomizedRunner$6.evaluate(RandomizedRunner.java:852)
20-Sep-2019 11:00:38    [junit4]    >         at com.carrotsearch.randomizedtesting.RandomizedRunner$7.evaluate(RandomizedRunner.java:863)
20-Sep-2019 11:00:38    [junit4]    >         at com.carrotsearch.randomizedtesting.rules.NoShadowingOrOverridesOnMethodsRule$1.evaluate(NoShadowingOrOverridesOnMethodsRule.java:40)
20-Sep-2019 11:00:38    [junit4]    >         at com.carrotsearch.randomizedtesting.rules.NoShadowingOrOverridesOnMethodsRule$1.evaluate(NoShadowingOrOverridesOnMethodsRule.java:40)
20-Sep-2019 11:00:38    [junit4]    >         at com.carrotsearch.randomizedtesting.rules.SystemPropertiesInvariantRule$1.evaluate(SystemPropertiesInvariantRule.java:59)
20-Sep-2019 11:00:38    [junit4]    >         at com.carrotsearch.randomizedtesting.rules.StatementAdapter.evaluate(StatementAdapter.java:36)
20-Sep-2019 11:00:38    [junit4]    >         at com.carrotsearch.randomizedtesting.ThreadLeakControl$StatementRunner.run(ThreadLeakControl.java:367)
20-Sep-2019 11:00:38    [junit4]    >         at java.lang.Thread.run(Thread.java:745)
20-Sep-2019 11:00:38    [junit4] ERROR   0.00s J1 | ProcessingResultTest.testSerializationDeserializationAttributesOnly <<<
20-Sep-2019 11:00:38    [junit4]    > Throwable #1: java.lang.UnsupportedClassVersionError: org/simpleframework/xml/core/Persister
20-Sep-2019 11:00:38    [junit4]    >         at __randomizedtesting.SeedInfo.seed([D0B241FC88C4131E:7B36308288FC3FC2]:0)
20-Sep-2019 11:00:38    [junit4]    >         at org.carrot2.core.ProcessingResult.serialize(ProcessingResult.java:349)
20-Sep-2019 11:00:38    [junit4]    >         at org.carrot2.core.ProcessingResult.serialize(ProcessingResult.java:320)
20-Sep-2019 11:00:38    [junit4]    >         at org.carrot2.core.ProcessingResult.serialize(ProcessingResult.java:297)
20-Sep-2019 11:00:38    [junit4]    >         at org.carrot2.core.ProcessingResultTest.checkSerializationDeserialization(ProcessingResultTest.java:407)
20-Sep-2019 11:00:38    [junit4]    >         at org.carrot2.core.ProcessingResultTest.testSerializationDeserializationAttributesOnly(ProcessingResultTest.java:73)
20-Sep-2019 11:00:38    [junit4]    >         at sun.reflect.NativeMethodAccessorImpl.invoke0(Native Method)
20-Sep-2019 11:00:38    [junit4]    >         at sun.reflect.NativeMethodAccessorImpl.invoke(NativeMethodAccessorImpl.java:57)
20-Sep-2019 11:00:38    [junit4]    >         at sun.reflect.DelegatingMethodAccessorImpl.invoke(DelegatingMethodAccessorImpl.java:43)
20-Sep-2019 11:00:38    [junit4]    >         at java.lang.reflect.Method.invoke(Method.java:606)
20-Sep-2019 11:00:38    [junit4]    >         at com.carrotsearch.randomizedtesting.RandomizedRunner.invoke(RandomizedRunner.java:1713)
20-Sep-2019 11:00:38    [junit4]    >         at com.carrotsearch.randomizedtesting.RandomizedRunner$8.evaluate(RandomizedRunner.java:907)
20-Sep-2019 11:00:38    [junit4]    >         at com.carrotsearch.randomizedtesting.rules.SystemPropertiesInvariantRule$1.evaluate(SystemPropertiesInvariantRule.java:59)
20-Sep-2019 11:00:38    [junit4]    >         at com.carrotsearch.randomizedtesting.rules.StatementAdapter.evaluate(StatementAdapter.java:36)
20-Sep-2019 11:00:38    [junit4]    >         at com.carrotsearch.randomizedtesting.ThreadLeakControl$StatementRunner.run(ThreadLeakControl.java:367)
20-Sep-2019 11:00:38    [junit4]    >         at com.carrotsearch.randomizedtesting.ThreadLeakControl.forkTimeoutingTask(ThreadLeakControl.java:811)
20-Sep-2019 11:00:38    [junit4]    >         at com.carrotsearch.randomizedtesting.ThreadLeakControl$3.evaluate(ThreadLeakControl.java:462)
20-Sep-2019 11:00:38    [junit4]    >         at com.carrotsearch.randomizedtesting.RandomizedRunner.runSingleTest(RandomizedRunner.java:916)
20-Sep-2019 11:00:38    [junit4]    >         at com.carrotsearch.randomizedtesting.RandomizedRunner$5.evaluate(RandomizedRunner.java:802)
20-Sep-2019 11:00:38    [junit4]    >         at com.carrotsearch.randomizedtesting.RandomizedRunner$6.evaluate(RandomizedRunner.java:852)
20-Sep-2019 11:00:38    [junit4]    >         at com.carrotsearch.randomizedtesting.RandomizedRunner$7.evaluate(RandomizedRunner.java:863)
20-Sep-2019 11:00:38    [junit4]    >         at com.carrotsearch.randomizedtesting.rules.NoShadowingOrOverridesOnMethodsRule$1.evaluate(NoShadowingOrOverridesOnMethodsRule.java:40)
20-Sep-2019 11:00:38    [junit4]    >         at com.carrotsearch.randomizedtesting.rules.NoShadowingOrOverridesOnMethodsRule$1.evaluate(NoShadowingOrOverridesOnMethodsRule.java:40)
20-Sep-2019 11:00:38    [junit4]    >         at com.carrotsearch.randomizedtesting.rules.SystemPropertiesInvariantRule$1.evaluate(SystemPropertiesInvariantRule.java:59)
20-Sep-2019 11:00:38    [junit4]    >         at com.carrotsearch.randomizedtesting.rules.StatementAdapter.evaluate(StatementAdapter.java:36)
20-Sep-2019 11:00:38    [junit4]    >         at com.carrotsearch.randomizedtesting.ThreadLeakControl$StatementRunner.run(ThreadLeakControl.java:367)
20-Sep-2019 11:00:38    [junit4]    >         at java.lang.Thread.run(Thread.java:745)
20-Sep-2019 11:00:38    [junit4] ERROR   0.00s J1 | ProcessingResultTest.testJsonSerializationWithCallback <<<
20-Sep-2019 11:00:38    [junit4]    > Throwable #1: java.lang.UnsupportedClassVersionError: org/simpleframework/xml/Root : Unsupported major.minor version 52.0
20-Sep-2019 11:00:38    [junit4]    >         at __randomizedtesting.SeedInfo.seed([D0B241FC88C4131E:887B2125DB6FE6D0]:0)
20-Sep-2019 11:00:38    [junit4]    >         at java.lang.ClassLoader.defineClass1(Native Method)
20-Sep-2019 11:00:38    [junit4]    >         at java.lang.ClassLoader.defineClass(ClassLoader.java:800)
20-Sep-2019 11:00:38    [junit4]    >         at java.security.SecureClassLoader.defineClass(SecureClassLoader.java:142)
20-Sep-2019 11:00:38    [junit4]    >         at java.net.URLClassLoader.defineClass(URLClassLoader.java:449)
20-Sep-2019 11:00:38    [junit4]    >         at java.net.URLClassLoader.access$100(URLClassLoader.java:71)
20-Sep-2019 11:00:38    [junit4]    >         at java.net.URLClassLoader$1.run(URLClassLoader.java:361)
20-Sep-2019 11:00:38    [junit4]    >         at java.net.URLClassLoader$1.run(URLClassLoader.java:355)
20-Sep-2019 11:00:38    [junit4]    >         at java.security.AccessController.doPrivileged(Native Method)
20-Sep-2019 11:00:38    [junit4]    >         at java.net.URLClassLoader.findClass(URLClassLoader.java:354)
20-Sep-2019 11:00:38    [junit4]    >         at java.lang.ClassLoader.loadClass(ClassLoader.java:425)
20-Sep-2019 11:00:38    [junit4]    >         at sun.misc.Launcher$AppClassLoader.loadClass(Launcher.java:308)
20-Sep-2019 11:00:38    [junit4]    >         at java.lang.ClassLoader.loadClass(ClassLoader.java:358)
20-Sep-2019 11:00:38    [junit4]    >         at java.lang.Class.forName0(Native Method)
20-Sep-2019 11:00:38    [junit4]    >         at java.lang.Class.forName(Class.java:278)
20-Sep-2019 11:00:38    [junit4]    >         at sun.reflect.generics.factory.CoreReflectionFactory.makeNamedType(CoreReflectionFactory.java:114)
20-Sep-2019 11:00:38    [junit4]    >         at sun.reflect.generics.visitor.Reifier.visitClassTypeSignature(Reifier.java:125)
20-Sep-2019 11:00:38    [junit4]    >         at sun.reflect.generics.tree.ClassTypeSignature.accept(ClassTypeSignature.java:49)
20-Sep-2019 11:00:38    [junit4]    >         at sun.reflect.annotation.AnnotationParser.parseSig(AnnotationParser.java:432)
20-Sep-2019 11:00:38    [junit4]    >         at sun.reflect.annotation.AnnotationParser.parseAnnotation2(AnnotationParser.java:238)
20-Sep-2019 11:00:38    [junit4]    >         at sun.reflect.annotation.AnnotationParser.parseAnnotations2(AnnotationParser.java:117)
20-Sep-2019 11:00:38    [junit4]    >         at sun.reflect.annotation.AnnotationParser.parseAnnotations(AnnotationParser.java:70)
20-Sep-2019 11:00:38    [junit4]    >         at java.lang.Class.initAnnotationsIfNecessary(Class.java:3281)
20-Sep-2019 11:00:38    [junit4]    >         at java.lang.Class.getDeclaredAnnotations(Class.java:3258)
20-Sep-2019 11:00:38    [junit4]    >         at com.fasterxml.jackson.databind.util.ClassUtil.findClassAnnotations(ClassUtil.java:1095)
20-Sep-2019 11:00:38    [junit4]    >         at com.fasterxml.jackson.databind.introspect.AnnotatedClassResolver.resolveClassAnnotations(AnnotatedClassResolver.java:154)
20-Sep-2019 11:00:38    [junit4]    >         at com.fasterxml.jackson.databind.introspect.AnnotatedClassResolver.resolveFully(AnnotatedClassResolver.java:118)
20-Sep-2019 11:00:38    [junit4]    >         at com.fasterxml.jackson.databind.introspect.AnnotatedClassResolver.resolve(AnnotatedClassResolver.java:69)
20-Sep-2019 11:00:38    [junit4]    >         at com.fasterxml.jackson.databind.introspect.BasicClassIntrospector._resolveAnnotatedClass(BasicClassIntrospector.java:282)
20-Sep-2019 11:00:38    [junit4]    >         at com.fasterxml.jackson.databind.introspect.BasicClassIntrospector.collectProperties(BasicClassIntrospector.java:192)
20-Sep-2019 11:00:38    [junit4]    >         at com.fasterxml.jackson.databind.introspect.BasicClassIntrospector.forSerialization(BasicClassIntrospector.java:92)
20-Sep-2019 11:00:38    [junit4]    >         at com.fasterxml.jackson.databind.introspect.BasicClassIntrospector.forSerialization(BasicClassIntrospector.java:16)
20-Sep-2019 11:00:38    [junit4]    >         at com.fasterxml.jackson.databind.SerializationConfig.introspect(SerializationConfig.java:778)
20-Sep-2019 11:00:38    [junit4]    >         at com.fasterxml.jackson.databind.ser.BeanSerializerFactory.createSerializer(BeanSerializerFactory.java:135)
20-Sep-2019 11:00:38    [junit4]    >         at com.fasterxml.jackson.databind.SerializerProvider._createUntypedSerializer(SerializerProvider.java:1388)
20-Sep-2019 11:00:38    [junit4]    >         at com.fasterxml.jackson.databind.SerializerProvider._createAndCacheUntypedSerializer(SerializerProvider.java:1336)
20-Sep-2019 11:00:38    [junit4]    >         at com.fasterxml.jackson.databind.SerializerProvider.findValueSerializer(SerializerProvider.java:510)
20-Sep-2019 11:00:38    [junit4]    >         at com.fasterxml.jackson.databind.ser.impl.PropertySerializerMap.findAndAddSecondarySerializer(PropertySerializerMap.java:90)
20-Sep-2019 11:00:38    [junit4]    >         at com.fasterxml.jackson.databind.ser.std.AsArraySerializerBase._findAndAddDynamic(AsArraySerializerBase.java:306)
20-Sep-2019 11:00:38    [junit4]    >         at com.fasterxml.jackson.databind.ser.impl.IndexedListSerializer.serializeContents(IndexedListSerializer.java:115)
20-Sep-2019 11:00:38    [junit4]    >         at com.fasterxml.jackson.databind.ser.impl.IndexedListSerializer.serialize(IndexedListSerializer.java:79)
20-Sep-2019 11:00:38    [junit4]    >         at com.fasterxml.jackson.databind.ser.impl.IndexedListSerializer.serialize(IndexedListSerializer.java:18)
20-Sep-2019 11:00:38    [junit4]    >         at com.fasterxml.jackson.databind.ser.std.MapSerializer.serializeFields(MapSerializer.java:722)
20-Sep-2019 11:00:38    [junit4]    >         at com.fasterxml.jackson.databind.ser.std.MapSerializer.serialize(MapSerializer.java:643)
20-Sep-2019 11:00:38    [junit4]    >         at com.fasterxml.jackson.databind.ser.std.MapSerializer.serialize(MapSerializer.java:33)
20-Sep-2019 11:00:38    [junit4]    >         at com.fasterxml.jackson.databind.ser.DefaultSerializerProvider._serialize(DefaultSerializerProvider.java:480)
20-Sep-2019 11:00:38    [junit4]    >         at com.fasterxml.jackson.databind.ser.DefaultSerializerProvider.serializeValue(DefaultSerializerProvider.java:319)
20-Sep-2019 11:00:38    [junit4]    >         at com.fasterxml.jackson.databind.ObjectMapper._configAndWriteValue(ObjectMapper.java:3906)
20-Sep-2019 11:00:38    [junit4]    >         at com.fasterxml.jackson.databind.ObjectMapper.writeValue(ObjectMapper.java:3202)
20-Sep-2019 11:00:38    [junit4]    >         at org.carrot2.core.ProcessingResult.serializeJson(ProcessingResult.java:483)
20-Sep-2019 11:00:38    [junit4]    >         at org.carrot2.core.ProcessingResult.serializeJson(ProcessingResult.java:449)
20-Sep-2019 11:00:38    [junit4]    >         at org.carrot2.core.ProcessingResult.serializeJson(ProcessingResult.java:428)
20-Sep-2019 11:00:38    [junit4]    >         at org.carrot2.core.ProcessingResultTest.testJsonSerializationWithCallback(ProcessingResultTest.java:274)
20-Sep-2019 11:00:38    [junit4]    >         at sun.reflect.NativeMethodAccessorImpl.invoke0(Native Method)
20-Sep-2019 11:00:38    [junit4]    >         at sun.reflect.NativeMethodAccessorImpl.invoke(NativeMethodAccessorImpl.java:57)
20-Sep-2019 11:00:38    [junit4]    >         at sun.reflect.DelegatingMethodAccessorImpl.invoke(DelegatingMethodAccessorImpl.java:43)
20-Sep-2019 11:00:38    [junit4]    >         at java.lang.reflect.Method.invoke(Method.java:606)
20-Sep-2019 11:00:38    [junit4]    >         at com.carrotsearch.randomizedtesting.RandomizedRunner.invoke(RandomizedRunner.java:1713)
20-Sep-2019 11:00:38    [junit4]    >         at com.carrotsearch.randomizedtesting.RandomizedRunner$8.evaluate(RandomizedRunner.java:907)
20-Sep-2019 11:00:38    [junit4]    >         at com.carrotsearch.randomizedtesting.rules.SystemPropertiesInvariantRule$1.evaluate(SystemPropertiesInvariantRule.java:59)
20-Sep-2019 11:00:38    [junit4]    >         at com.carrotsearch.randomizedtesting.rules.StatementAdapter.evaluate(StatementAdapter.java:36)
20-Sep-2019 11:00:38    [junit4]    >         at com.carrotsearch.randomizedtesting.ThreadLeakControl$StatementRunner.run(ThreadLeakControl.java:367)
20-Sep-2019 11:00:38    [junit4]    >         at com.carrotsearch.randomizedtesting.ThreadLeakControl.forkTimeoutingTask(ThreadLeakControl.java:811)
20-Sep-2019 11:00:38    [junit4]    >         at com.carrotsearch.randomizedtesting.ThreadLeakControl$3.evaluate(ThreadLeakControl.java:462)
20-Sep-2019 11:00:38    [junit4]    >         at com.carrotsearch.randomizedtesting.RandomizedRunner.runSingleTest(RandomizedRunner.java:916)
20-Sep-2019 11:00:38    [junit4]    >         at com.carrotsearch.randomizedtesting.RandomizedRunner$5.evaluate(RandomizedRunner.java:802)
20-Sep-2019 11:00:38    [junit4]    >         at com.carrotsearch.randomizedtesting.RandomizedRunner$6.evaluate(RandomizedRunner.java:852)
20-Sep-2019 11:00:38    [junit4]    >         at com.carrotsearch.randomizedtesting.RandomizedRunner$7.evaluate(RandomizedRunner.java:863)
20-Sep-2019 11:00:38    [junit4]    >         at com.carrotsearch.randomizedtesting.rules.NoShadowingOrOverridesOnMethodsRule$1.evaluate(NoShadowingOrOverridesOnMethodsRule.java:40)
20-Sep-2019 11:00:38    [junit4]    >         at com.carrotsearch.randomizedtesting.rules.NoShadowingOrOverridesOnMethodsRule$1.evaluate(NoShadowingOrOverridesOnMethodsRule.java:40)
20-Sep-2019 11:00:38    [junit4]    >         at com.carrotsearch.randomizedtesting.rules.SystemPropertiesInvariantRule$1.evaluate(SystemPropertiesInvariantRule.java:59)
20-Sep-2019 11:00:38    [junit4]    >         at com.carrotsearch.randomizedtesting.rules.StatementAdapter.evaluate(StatementAdapter.java:36)
20-Sep-2019 11:00:38    [junit4]    >         at com.carrotsearch.randomizedtesting.ThreadLeakControl$StatementRunner.run(ThreadLeakControl.java:367)
20-Sep-2019 11:00:38    [junit4]    >         at java.lang.Thread.run(Thread.java:745)
20-Sep-2019 11:00:38    [junit4] ERROR   0.00s J1 | ProcessingResultTest.testJsonSerializationClustersOnly <<<
20-Sep-2019 11:00:38    [junit4]    > Throwable #1: java.lang.UnsupportedClassVersionError: org/simpleframework/xml/Root : Unsupported major.minor version 52.0
20-Sep-2019 11:00:38    [junit4]    >         at __randomizedtesting.SeedInfo.seed([D0B241FC88C4131E:B14C81D007785494]:0)
20-Sep-2019 11:00:38    [junit4]    >         at java.lang.ClassLoader.defineClass1(Native Method)
20-Sep-2019 11:00:38    [junit4]    >         at java.lang.ClassLoader.defineClass(ClassLoader.java:800)
20-Sep-2019 11:00:38    [junit4]    >         at java.security.SecureClassLoader.defineClass(SecureClassLoader.java:142)
20-Sep-2019 11:00:38    [junit4]    >         at java.net.URLClassLoader.defineClass(URLClassLoader.java:449)
20-Sep-2019 11:00:38    [junit4]    >         at java.net.URLClassLoader.access$100(URLClassLoader.java:71)
20-Sep-2019 11:00:38    [junit4]    >         at java.net.URLClassLoader$1.run(URLClassLoader.java:361)
20-Sep-2019 11:00:38    [junit4]    >         at java.net.URLClassLoader$1.run(URLClassLoader.java:355)
20-Sep-2019 11:00:38    [junit4]    >         at java.security.AccessController.doPrivileged(Native Method)
20-Sep-2019 11:00:38    [junit4]    >         at java.net.URLClassLoader.findClass(URLClassLoader.java:354)
20-Sep-2019 11:00:38    [junit4]    >         at java.lang.ClassLoader.loadClass(ClassLoader.java:425)
20-Sep-2019 11:00:38    [junit4]    >         at sun.misc.Launcher$AppClassLoader.loadClass(Launcher.java:308)
20-Sep-2019 11:00:38    [junit4]    >         at java.lang.ClassLoader.loadClass(ClassLoader.java:358)
20-Sep-2019 11:00:38    [junit4]    >         at java.lang.Class.forName0(Native Method)
20-Sep-2019 11:00:38    [junit4]    >         at java.lang.Class.forName(Class.java:278)
20-Sep-2019 11:00:38    [junit4]    >         at sun.reflect.generics.factory.CoreReflectionFactory.makeNamedType(CoreReflectionFactory.java:114)
20-Sep-2019 11:00:38    [junit4]    >         at sun.reflect.generics.visitor.Reifier.visitClassTypeSignature(Reifier.java:125)
20-Sep-2019 11:00:38    [junit4]    >         at sun.reflect.generics.tree.ClassTypeSignature.accept(ClassTypeSignature.java:49)
20-Sep-2019 11:00:38    [junit4]    >         at sun.reflect.annotation.AnnotationParser.parseSig(AnnotationParser.java:432)
20-Sep-2019 11:00:38    [junit4]    >         at sun.reflect.annotation.AnnotationParser.parseAnnotation2(AnnotationParser.java:238)
20-Sep-2019 11:00:38    [junit4]    >         at sun.reflect.annotation.AnnotationParser.parseAnnotations2(AnnotationParser.java:117)
20-Sep-2019 11:00:38    [junit4]    >         at sun.reflect.annotation.AnnotationParser.parseAnnotations(AnnotationParser.java:70)
20-Sep-2019 11:00:38    [junit4]    >         at java.lang.Class.initAnnotationsIfNecessary(Class.java:3281)
20-Sep-2019 11:00:38    [junit4]    >         at java.lang.Class.getDeclaredAnnotations(Class.java:3258)
20-Sep-2019 11:00:38    [junit4]    >         at com.fasterxml.jackson.databind.util.ClassUtil.findClassAnnotations(ClassUtil.java:1095)
20-Sep-2019 11:00:38    [junit4]    >         at com.fasterxml.jackson.databind.introspect.AnnotatedClassResolver.resolveClassAnnotations(AnnotatedClassResolver.java:154)
20-Sep-2019 11:00:38    [junit4]    >         at com.fasterxml.jackson.databind.introspect.AnnotatedClassResolver.resolveFully(AnnotatedClassResolver.java:118)
20-Sep-2019 11:00:38    [junit4]    >         at com.fasterxml.jackson.databind.introspect.AnnotatedClassResolver.resolve(AnnotatedClassResolver.java:69)
20-Sep-2019 11:00:38    [junit4]    >         at com.fasterxml.jackson.databind.introspect.BasicClassIntrospector._resolveAnnotatedClass(BasicClassIntrospector.java:282)
20-Sep-2019 11:00:38    [junit4]    >         at com.fasterxml.jackson.databind.introspect.BasicClassIntrospector.collectProperties(BasicClassIntrospector.java:192)
20-Sep-2019 11:00:38    [junit4]    >         at com.fasterxml.jackson.databind.introspect.BasicClassIntrospector.forSerialization(BasicClassIntrospector.java:92)
20-Sep-2019 11:00:38    [junit4]    >         at com.fasterxml.jackson.databind.introspect.BasicClassIntrospector.forSerialization(BasicClassIntrospector.java:16)
20-Sep-2019 11:00:38    [junit4]    >         at com.fasterxml.jackson.databind.SerializationConfig.introspect(SerializationConfig.java:778)
20-Sep-2019 11:00:38    [junit4]    >         at com.fasterxml.jackson.databind.ser.BeanSerializerFactory.createSerializer(BeanSerializerFactory.java:135)
20-Sep-2019 11:00:38    [junit4]    >         at com.fasterxml.jackson.databind.SerializerProvider._createUntypedSerializer(SerializerProvider.java:1388)
20-Sep-2019 11:00:38    [junit4]    >         at com.fasterxml.jackson.databind.SerializerProvider._createAndCacheUntypedSerializer(SerializerProvider.java:1336)
20-Sep-2019 11:00:38    [junit4]    >         at com.fasterxml.jackson.databind.SerializerProvider.findValueSerializer(SerializerProvider.java:510)
20-Sep-2019 11:00:38    [junit4]    >         at com.fasterxml.jackson.databind.ser.impl.PropertySerializerMap.findAndAddSecondarySerializer(PropertySerializerMap.java:90)
20-Sep-2019 11:00:38    [junit4]    >         at com.fasterxml.jackson.databind.ser.std.AsArraySerializerBase._findAndAddDynamic(AsArraySerializerBase.java:306)
20-Sep-2019 11:00:38    [junit4]    >         at com.fasterxml.jackson.databind.ser.impl.IndexedListSerializer.serializeContents(IndexedListSerializer.java:115)
20-Sep-2019 11:00:38    [junit4]    >         at com.fasterxml.jackson.databind.ser.impl.IndexedListSerializer.serialize(IndexedListSerializer.java:79)
20-Sep-2019 11:00:38    [junit4]    >         at com.fasterxml.jackson.databind.ser.impl.IndexedListSerializer.serialize(IndexedListSerializer.java:18)
20-Sep-2019 11:00:38    [junit4]    >         at com.fasterxml.jackson.databind.ser.std.MapSerializer.serializeFields(MapSerializer.java:722)
20-Sep-2019 11:00:38    [junit4]    >         at com.fasterxml.jackson.databind.ser.std.MapSerializer.serialize(MapSerializer.java:643)
20-Sep-2019 11:00:38    [junit4]    >         at com.fasterxml.jackson.databind.ser.std.MapSerializer.serialize(MapSerializer.java:33)
20-Sep-2019 11:00:38    [junit4]    >         at com.fasterxml.jackson.databind.ser.DefaultSerializerProvider._serialize(DefaultSerializerProvider.java:480)
20-Sep-2019 11:00:38    [junit4]    >         at com.fasterxml.jackson.databind.ser.DefaultSerializerProvider.serializeValue(DefaultSerializerProvider.java:319)
20-Sep-2019 11:00:38    [junit4]    >         at com.fasterxml.jackson.databind.ObjectMapper._configAndWriteValue(ObjectMapper.java:3906)
20-Sep-2019 11:00:38    [junit4]    >         at com.fasterxml.jackson.databind.ObjectMapper.writeValue(ObjectMapper.java:3202)
20-Sep-2019 11:00:38    [junit4]    >         at org.carrot2.core.ProcessingResult.serializeJson(ProcessingResult.java:483)
20-Sep-2019 11:00:38    [junit4]    >         at org.carrot2.core.ProcessingResultTest.getJsonString(ProcessingResultTest.java:388)
20-Sep-2019 11:00:38    [junit4]    >         at org.carrot2.core.ProcessingResultTest.getJsonRootNode(ProcessingResultTest.java:375)
20-Sep-2019 11:00:38    [junit4]    >         at org.carrot2.core.ProcessingResultTest.testJsonSerializationClustersOnly(ProcessingResultTest.java:305)
20-Sep-2019 11:00:38    [junit4]    >         at sun.reflect.NativeMethodAccessorImpl.invoke0(Native Method)
20-Sep-2019 11:00:38    [junit4]    >         at sun.reflect.NativeMethodAccessorImpl.invoke(NativeMethodAccessorImpl.java:57)
20-Sep-2019 11:00:38    [junit4]    >         at sun.reflect.DelegatingMethodAccessorImpl.invoke(DelegatingMethodAccessorImpl.java:43)
20-Sep-2019 11:00:38    [junit4]    >         at java.lang.reflect.Method.invoke(Method.java:606)
20-Sep-2019 11:00:38    [junit4]    >         at com.carrotsearch.randomizedtesting.RandomizedRunner.invoke(RandomizedRunner.java:1713)
20-Sep-2019 11:00:38    [junit4]    >         at com.carrotsearch.randomizedtesting.RandomizedRunner$8.evaluate(RandomizedRunner.java:907)
20-Sep-2019 11:00:38    [junit4]    >         at com.carrotsearch.randomizedtesting.rules.SystemPropertiesInvariantRule$1.evaluate(SystemPropertiesInvariantRule.java:59)
20-Sep-2019 11:00:38    [junit4]    >         at com.carrotsearch.randomizedtesting.rules.StatementAdapter.evaluate(StatementAdapter.java:36)
20-Sep-2019 11:00:38    [junit4]    >         at com.carrotsearch.randomizedtesting.ThreadLeakControl$StatementRunner.run(ThreadLeakControl.java:367)
20-Sep-2019 11:00:38    [junit4]    >         at com.carrotsearch.randomizedtesting.ThreadLeakControl.forkTimeoutingTask(ThreadLeakControl.java:811)
20-Sep-2019 11:00:38    [junit4]    >         at com.carrotsearch.randomizedtesting.ThreadLeakControl$3.evaluate(ThreadLeakControl.java:462)
20-Sep-2019 11:00:38    [junit4]    >         at com.carrotsearch.randomizedtesting.RandomizedRunner.runSingleTest(RandomizedRunner.java:916)
20-Sep-2019 11:00:38    [junit4]    >         at com.carrotsearch.randomizedtesting.RandomizedRunner$5.evaluate(RandomizedRunner.java:802)
20-Sep-2019 11:00:38    [junit4]    >         at com.carrotsearch.randomizedtesting.RandomizedRunner$6.evaluate(RandomizedRunner.java:852)
20-Sep-2019 11:00:38    [junit4]    >         at com.carrotsearch.randomizedtesting.RandomizedRunner$7.evaluate(RandomizedRunner.java:863)
20-Sep-2019 11:00:38    [junit4]    >         at com.carrotsearch.randomizedtesting.rules.NoShadowingOrOverridesOnMethodsRule$1.evaluate(NoShadowingOrOverridesOnMethodsRule.java:40)
20-Sep-2019 11:00:38    [junit4]    >         at com.carrotsearch.randomizedtesting.rules.NoShadowingOrOverridesOnMethodsRule$1.evaluate(NoShadowingOrOverridesOnMethodsRule.java:40)
20-Sep-2019 11:00:38    [junit4]    >         at com.carrotsearch.randomizedtesting.rules.SystemPropertiesInvariantRule$1.evaluate(SystemPropertiesInvariantRule.java:59)
20-Sep-2019 11:00:38    [junit4]    >         at com.carrotsearch.randomizedtesting.rules.StatementAdapter.evaluate(StatementAdapter.java:36)
20-Sep-2019 11:00:38    [junit4]    >         at com.carrotsearch.randomizedtesting.ThreadLeakControl$StatementRunner.run(ThreadLeakControl.java:367)
20-Sep-2019 11:00:38    [junit4]    >         at java.lang.Thread.run(Thread.java:745)
20-Sep-2019 11:00:38    [junit4] ERROR   0.00s J1 | ProcessingResultTest.testSerializationDeserializationAll <<<
20-Sep-2019 11:00:38    [junit4]    > Throwable #1: java.lang.UnsupportedClassVersionError: org/simpleframework/xml/core/Persister
20-Sep-2019 11:00:38    [junit4]    >         at __randomizedtesting.SeedInfo.seed([D0B241FC88C4131E:3155D149F1068B5E]:0)
20-Sep-2019 11:00:38    [junit4]    >         at org.carrot2.core.ProcessingResult.serialize(ProcessingResult.java:349)
20-Sep-2019 11:00:38    [junit4]    >         at org.carrot2.core.ProcessingResult.serialize(ProcessingResult.java:320)
20-Sep-2019 11:00:38    [junit4]    >         at org.carrot2.core.ProcessingResult.serialize(ProcessingResult.java:297)
20-Sep-2019 11:00:38    [junit4]    >         at org.carrot2.core.ProcessingResultTest.checkSerializationDeserialization(ProcessingResultTest.java:407)
20-Sep-2019 11:00:38    [junit4]    >         at org.carrot2.core.ProcessingResultTest.testSerializationDeserializationAll(ProcessingResultTest.java:55)
20-Sep-2019 11:00:38    [junit4]    >         at sun.reflect.NativeMethodAccessorImpl.invoke0(Native Method)
20-Sep-2019 11:00:38    [junit4]    >         at sun.reflect.NativeMethodAccessorImpl.invoke(NativeMethodAccessorImpl.java:57)
20-Sep-2019 11:00:38    [junit4]    >         at sun.reflect.DelegatingMethodAccessorImpl.invoke(DelegatingMethodAccessorImpl.java:43)
20-Sep-2019 11:00:38    [junit4]    >         at java.lang.reflect.Method.invoke(Method.java:606)
20-Sep-2019 11:00:38    [junit4]    >         at com.carrotsearch.randomizedtesting.RandomizedRunner.invoke(RandomizedRunner.java:1713)
20-Sep-2019 11:00:38    [junit4]    >         at com.carrotsearch.randomizedtesting.RandomizedRunner$8.evaluate(RandomizedRunner.java:907)
20-Sep-2019 11:00:38    [junit4]    >         at com.carrotsearch.randomizedtesting.rules.SystemPropertiesInvariantRule$1.evaluate(SystemPropertiesInvariantRule.java:59)
20-Sep-2019 11:00:38    [junit4]    >         at com.carrotsearch.randomizedtesting.rules.StatementAdapter.evaluate(StatementAdapter.java:36)
20-Sep-2019 11:00:38    [junit4]    >         at com.carrotsearch.randomizedtesting.ThreadLeakControl$StatementRunner.run(ThreadLeakControl.java:367)
20-Sep-2019 11:00:38    [junit4]    >         at com.carrotsearch.randomizedtesting.ThreadLeakControl.forkTimeoutingTask(ThreadLeakControl.java:811)
20-Sep-2019 11:00:38    [junit4]    >         at com.carrotsearch.randomizedtesting.ThreadLeakControl$3.evaluate(ThreadLeakControl.java:462)
20-Sep-2019 11:00:38    [junit4]    >         at com.carrotsearch.randomizedtesting.RandomizedRunner.runSingleTest(RandomizedRunner.java:916)
20-Sep-2019 11:00:38    [junit4]    >         at com.carrotsearch.randomizedtesting.RandomizedRunner$5.evaluate(RandomizedRunner.java:802)
20-Sep-2019 11:00:38    [junit4]    >         at com.carrotsearch.randomizedtesting.RandomizedRunner$6.evaluate(RandomizedRunner.java:852)
20-Sep-2019 11:00:38    [junit4]    >         at com.carrotsearch.randomizedtesting.RandomizedRunner$7.evaluate(RandomizedRunner.java:863)
20-Sep-2019 11:00:38    [junit4]    >         at com.carrotsearch.randomizedtesting.rules.NoShadowingOrOverridesOnMethodsRule$1.evaluate(NoShadowingOrOverridesOnMethodsRule.java:40)
20-Sep-2019 11:00:38    [junit4]    >         at com.carrotsearch.randomizedtesting.rules.NoShadowingOrOverridesOnMethodsRule$1.evaluate(NoShadowingOrOverridesOnMethodsRule.java:40)
20-Sep-2019 11:00:38    [junit4]    >         at com.carrotsearch.randomizedtesting.rules.SystemPropertiesInvariantRule$1.evaluate(SystemPropertiesInvariantRule.java:59)
20-Sep-2019 11:00:38    [junit4]    >         at com.carrotsearch.randomizedtesting.rules.StatementAdapter.evaluate(StatementAdapter.java:36)
20-Sep-2019 11:00:38    [junit4]    >         at com.carrotsearch.randomizedtesting.ThreadLeakControl$StatementRunner.run(ThreadLeakControl.java:367)
20-Sep-2019 11:00:38    [junit4]    >         at java.lang.Thread.run(Thread.java:745)
20-Sep-2019 11:00:38    [junit4] ERROR   0.00s J1 | ProcessingResultTest.testSerializationDeserializationClustersOnly <<<
20-Sep-2019 11:00:38    [junit4]    > Throwable #1: java.lang.UnsupportedClassVersionError: org/simpleframework/xml/core/Persister
20-Sep-2019 11:00:38    [junit4]    >         at __randomizedtesting.SeedInfo.seed([D0B241FC88C4131E:1661B496AACAC4DF]:0)
20-Sep-2019 11:00:38    [junit4]    >         at org.carrot2.core.ProcessingResult.serialize(ProcessingResult.java:349)
20-Sep-2019 11:00:38    [junit4]    >         at org.carrot2.core.ProcessingResult.serialize(ProcessingResult.java:320)
20-Sep-2019 11:00:38    [junit4]    >         at org.carrot2.core.ProcessingResult.serialize(ProcessingResult.java:297)
20-Sep-2019 11:00:38    [junit4]    >         at org.carrot2.core.ProcessingResultTest.checkSerializationDeserialization(ProcessingResultTest.java:407)
20-Sep-2019 11:00:38    [junit4]    >         at org.carrot2.core.ProcessingResultTest.testSerializationDeserializationClustersOnly(ProcessingResultTest.java:67)
20-Sep-2019 11:00:38    [junit4]    >         at sun.reflect.NativeMethodAccessorImpl.invoke0(Native Method)
20-Sep-2019 11:00:38    [junit4]    >         at sun.reflect.NativeMethodAccessorImpl.invoke(NativeMethodAccessorImpl.java:57)
20-Sep-2019 11:00:38    [junit4]    >         at sun.reflect.DelegatingMethodAccessorImpl.invoke(DelegatingMethodAccessorImpl.java:43)
20-Sep-2019 11:00:38    [junit4]    >         at java.lang.reflect.Method.invoke(Method.java:606)
20-Sep-2019 11:00:38    [junit4]    >         at com.carrotsearch.randomizedtesting.RandomizedRunner.invoke(RandomizedRunner.java:1713)
20-Sep-2019 11:00:38    [junit4]    >         at com.carrotsearch.randomizedtesting.RandomizedRunner$8.evaluate(RandomizedRunner.java:907)
20-Sep-2019 11:00:38    [junit4]    >         at com.carrotsearch.randomizedtesting.rules.SystemPropertiesInvariantRule$1.evaluate(SystemPropertiesInvariantRule.java:59)
20-Sep-2019 11:00:38    [junit4]    >         at com.carrotsearch.randomizedtesting.rules.StatementAdapter.evaluate(StatementAdapter.java:36)
20-Sep-2019 11:00:38    [junit4]    >         at com.carrotsearch.randomizedtesting.ThreadLeakControl$StatementRunner.run(ThreadLeakControl.java:367)
20-Sep-2019 11:00:38    [junit4]    >         at com.carrotsearch.randomizedtesting.ThreadLeakControl.forkTimeoutingTask(ThreadLeakControl.java:811)
20-Sep-2019 11:00:38    [junit4]    >         at com.carrotsearch.randomizedtesting.ThreadLeakControl$3.evaluate(ThreadLeakControl.java:462)
20-Sep-2019 11:00:38    [junit4]    >         at com.carrotsearch.randomizedtesting.RandomizedRunner.runSingleTest(RandomizedRunner.java:916)
20-Sep-2019 11:00:38    [junit4]    >         at com.carrotsearch.randomizedtesting.RandomizedRunner$5.evaluate(RandomizedRunner.java:802)
20-Sep-2019 11:00:38    [junit4]    >         at com.carrotsearch.randomizedtesting.RandomizedRunner$6.evaluate(RandomizedRunner.java:852)
20-Sep-2019 11:00:38    [junit4]    >         at com.carrotsearch.randomizedtesting.RandomizedRunner$7.evaluate(RandomizedRunner.java:863)
20-Sep-2019 11:00:38    [junit4]    >         at com.carrotsearch.randomizedtesting.rules.NoShadowingOrOverridesOnMethodsRule$1.evaluate(NoShadowingOrOverridesOnMethodsRule.java:40)
20-Sep-2019 11:00:38    [junit4]    >         at com.carrotsearch.randomizedtesting.rules.NoShadowingOrOverridesOnMethodsRule$1.evaluate(NoShadowingOrOverridesOnMethodsRule.java:40)
20-Sep-2019 11:00:38    [junit4]    >         at com.carrotsearch.randomizedtesting.rules.SystemPropertiesInvariantRule$1.evaluate(SystemPropertiesInvariantRule.java:59)
20-Sep-2019 11:00:38    [junit4]    >         at com.carrotsearch.randomizedtesting.rules.StatementAdapter.evaluate(StatementAdapter.java:36)
20-Sep-2019 11:00:38    [junit4]    >         at com.carrotsearch.randomizedtesting.ThreadLeakControl$StatementRunner.run(ThreadLeakControl.java:367)
20-Sep-2019 11:00:38    [junit4]    >         at java.lang.Thread.run(Thread.java:745)
20-Sep-2019 11:00:38    [junit4] ERROR   0.02s J1 | ProcessingResultTest.testDocumentDeserializationLanguageByIsoCode <<<
20-Sep-2019 11:00:38    [junit4]    > Throwable #1: java.lang.UnsupportedClassVersionError: org/simpleframework/xml/core/Persister
20-Sep-2019 11:00:38    [junit4]    >         at __randomizedtesting.SeedInfo.seed([D0B241FC88C4131E:4B08E60F66B7CF77]:0)
20-Sep-2019 11:00:38    [junit4]    >         at org.carrot2.core.ProcessingResult.deserialize(ProcessingResult.java:372)
20-Sep-2019 11:00:38    [junit4]    >         at org.carrot2.core.ProcessingResultTest.testDocumentDeserializationLanguageByIsoCode(ProcessingResultTest.java:141)
20-Sep-2019 11:00:38    [junit4]    >         at sun.reflect.NativeMethodAccessorImpl.invoke0(Native Method)
20-Sep-2019 11:00:38    [junit4]    >         at sun.reflect.NativeMethodAccessorImpl.invoke(NativeMethodAccessorImpl.java:57)
20-Sep-2019 11:00:38    [junit4]    >         at sun.reflect.DelegatingMethodAccessorImpl.invoke(DelegatingMethodAccessorImpl.java:43)
20-Sep-2019 11:00:38    [junit4]    >         at java.lang.reflect.Method.invoke(Method.java:606)
20-Sep-2019 11:00:38    [junit4]    >         at com.carrotsearch.randomizedtesting.RandomizedRunner.invoke(RandomizedRunner.java:1713)
20-Sep-2019 11:00:38    [junit4]    >         at com.carrotsearch.randomizedtesting.RandomizedRunner$8.evaluate(RandomizedRunner.java:907)
20-Sep-2019 11:00:38    [junit4]    >         at com.carrotsearch.randomizedtesting.rules.SystemPropertiesInvariantRule$1.evaluate(SystemPropertiesInvariantRule.java:59)
20-Sep-2019 11:00:38    [junit4]    >         at com.carrotsearch.randomizedtesting.rules.StatementAdapter.evaluate(StatementAdapter.java:36)
20-Sep-2019 11:00:38    [junit4]    >         at com.carrotsearch.randomizedtesting.ThreadLeakControl$StatementRunner.run(ThreadLeakControl.java:367)
20-Sep-2019 11:00:38    [junit4]    >         at com.carrotsearch.randomizedtesting.ThreadLeakControl.forkTimeoutingTask(ThreadLeakControl.java:811)
20-Sep-2019 11:00:38    [junit4]    >         at com.carrotsearch.randomizedtesting.ThreadLeakControl$3.evaluate(ThreadLeakControl.java:462)
20-Sep-2019 11:00:38    [junit4]    >         at com.carrotsearch.randomizedtesting.RandomizedRunner.runSingleTest(RandomizedRunner.java:916)
20-Sep-2019 11:00:38    [junit4]    >         at com.carrotsearch.randomizedtesting.RandomizedRunner$5.evaluate(RandomizedRunner.java:802)
20-Sep-2019 11:00:38    [junit4]    >         at com.carrotsearch.randomizedtesting.RandomizedRunner$6.evaluate(RandomizedRunner.java:852)
20-Sep-2019 11:00:38    [junit4]    >         at com.carrotsearch.randomizedtesting.RandomizedRunner$7.evaluate(RandomizedRunner.java:863)
20-Sep-2019 11:00:38    [junit4]    >         at com.carrotsearch.randomizedtesting.rules.NoShadowingOrOverridesOnMethodsRule$1.evaluate(NoShadowingOrOverridesOnMethodsRule.java:40)
20-Sep-2019 11:00:38    [junit4]    >         at com.carrotsearch.randomizedtesting.rules.NoShadowingOrOverridesOnMethodsRule$1.evaluate(NoShadowingOrOverridesOnMethodsRule.java:40)
20-Sep-2019 11:00:38    [junit4]    >         at com.carrotsearch.randomizedtesting.rules.SystemPropertiesInvariantRule$1.evaluate(SystemPropertiesInvariantRule.java:59)
20-Sep-2019 11:00:38    [junit4]    >         at com.carrotsearch.randomizedtesting.rules.StatementAdapter.evaluate(StatementAdapter.java:36)
20-Sep-2019 11:00:38    [junit4]    >         at com.carrotsearch.randomizedtesting.ThreadLeakControl$StatementRunner.run(ThreadLeakControl.java:367)
20-Sep-2019 11:00:38    [junit4]    >         at java.lang.Thread.run(Thread.java:745)
20-Sep-2019 11:00:38    [junit4] ERROR   0.00s J1 | ProcessingResultTest.testJsonSerializationAll <<<
20-Sep-2019 11:00:38    [junit4]    > Throwable #1: java.lang.UnsupportedClassVersionError: org/simpleframework/xml/Root : Unsupported major.minor version 52.0
20-Sep-2019 11:00:38    [junit4]    >         at __randomizedtesting.SeedInfo.seed([D0B241FC88C4131E:3208F9D03FC715DF]:0)
20-Sep-2019 11:00:38    [junit4]    >         at java.lang.ClassLoader.defineClass1(Native Method)
20-Sep-2019 11:00:38    [junit4]    >         at java.lang.ClassLoader.defineClass(ClassLoader.java:800)
20-Sep-2019 11:00:38    [junit4]    >         at java.security.SecureClassLoader.defineClass(SecureClassLoader.java:142)
20-Sep-2019 11:00:38    [junit4]    >         at java.net.URLClassLoader.defineClass(URLClassLoader.java:449)
20-Sep-2019 11:00:38    [junit4]    >         at java.net.URLClassLoader.access$100(URLClassLoader.java:71)
20-Sep-2019 11:00:38    [junit4]    >         at java.net.URLClassLoader$1.run(URLClassLoader.java:361)
20-Sep-2019 11:00:38    [junit4]    >         at java.net.URLClassLoader$1.run(URLClassLoader.java:355)
20-Sep-2019 11:00:38    [junit4]    >         at java.security.AccessController.doPrivileged(Native Method)
20-Sep-2019 11:00:38    [junit4]    >         at java.net.URLClassLoader.findClass(URLClassLoader.java:354)
20-Sep-2019 11:00:38    [junit4]    >         at java.lang.ClassLoader.loadClass(ClassLoader.java:425)
20-Sep-2019 11:00:38    [junit4]    >         at sun.misc.Launcher$AppClassLoader.loadClass(Launcher.java:308)
20-Sep-2019 11:00:38    [junit4]    >         at java.lang.ClassLoader.loadClass(ClassLoader.java:358)
20-Sep-2019 11:00:38    [junit4]    >         at java.lang.Class.forName0(Native Method)
20-Sep-2019 11:00:38    [junit4]    >         at java.lang.Class.forName(Class.java:278)
20-Sep-2019 11:00:38    [junit4]    >         at sun.reflect.generics.factory.CoreReflectionFactory.makeNamedType(CoreReflectionFactory.java:114)
20-Sep-2019 11:00:38    [junit4]    >         at sun.reflect.generics.visitor.Reifier.visitClassTypeSignature(Reifier.java:125)
20-Sep-2019 11:00:38    [junit4]    >         at sun.reflect.generics.tree.ClassTypeSignature.accept(ClassTypeSignature.java:49)
20-Sep-2019 11:00:38    [junit4]    >         at sun.reflect.annotation.AnnotationParser.parseSig(AnnotationParser.java:432)
20-Sep-2019 11:00:38    [junit4]    >         at sun.reflect.annotation.AnnotationParser.parseAnnotation2(AnnotationParser.java:238)
20-Sep-2019 11:00:38    [junit4]    >         at sun.reflect.annotation.AnnotationParser.parseAnnotations2(AnnotationParser.java:117)
20-Sep-2019 11:00:38    [junit4]    >         at sun.reflect.annotation.AnnotationParser.parseAnnotations(AnnotationParser.java:70)
20-Sep-2019 11:00:38    [junit4]    >         at java.lang.Class.initAnnotationsIfNecessary(Class.java:3281)
20-Sep-2019 11:00:38    [junit4]    >         at java.lang.Class.getDeclaredAnnotations(Class.java:3258)
20-Sep-2019 11:00:38    [junit4]    >         at com.fasterxml.jackson.databind.util.ClassUtil.findClassAnnotations(ClassUtil.java:1095)
20-Sep-2019 11:00:38    [junit4]    >         at com.fasterxml.jackson.databind.introspect.AnnotatedClassResolver.resolveClassAnnotations(AnnotatedClassResolver.java:154)
20-Sep-2019 11:00:38    [junit4]    >         at com.fasterxml.jackson.databind.introspect.AnnotatedClassResolver.resolveFully(AnnotatedClassResolver.java:118)
20-Sep-2019 11:00:38    [junit4]    >         at com.fasterxml.jackson.databind.introspect.AnnotatedClassResolver.resolve(AnnotatedClassResolver.java:69)
20-Sep-2019 11:00:38    [junit4]    >         at com.fasterxml.jackson.databind.introspect.BasicClassIntrospector._resolveAnnotatedClass(BasicClassIntrospector.java:282)
20-Sep-2019 11:00:38    [junit4]    >         at com.fasterxml.jackson.databind.introspect.BasicClassIntrospector.collectProperties(BasicClassIntrospector.java:192)
20-Sep-2019 11:00:38    [junit4]    >         at com.fasterxml.jackson.databind.introspect.BasicClassIntrospector.forSerialization(BasicClassIntrospector.java:92)
20-Sep-2019 11:00:38    [junit4]    >         at com.fasterxml.jackson.databind.introspect.BasicClassIntrospector.forSerialization(BasicClassIntrospector.java:16)
20-Sep-2019 11:00:38    [junit4]    >         at com.fasterxml.jackson.databind.SerializationConfig.introspect(SerializationConfig.java:778)
20-Sep-2019 11:00:38    [junit4]    >         at com.fasterxml.jackson.databind.ser.BeanSerializerFactory.createSerializer(BeanSerializerFactory.java:135)
20-Sep-2019 11:00:38    [junit4]    >         at com.fasterxml.jackson.databind.SerializerProvider._createUntypedSerializer(SerializerProvider.java:1388)
20-Sep-2019 11:00:38    [junit4]    >         at com.fasterxml.jackson.databind.SerializerProvider._createAndCacheUntypedSerializer(SerializerProvider.java:1336)
20-Sep-2019 11:00:38    [junit4]    >         at com.fasterxml.jackson.databind.SerializerProvider.findValueSerializer(SerializerProvider.java:510)
20-Sep-2019 11:00:38    [junit4]    >         at com.fasterxml.jackson.databind.ser.impl.PropertySerializerMap.findAndAddSecondarySerializer(PropertySerializerMap.java:90)
20-Sep-2019 11:00:38    [junit4]    >         at com.fasterxml.jackson.databind.ser.std.AsArraySerializerBase._findAndAddDynamic(AsArraySerializerBase.java:306)
20-Sep-2019 11:00:38    [junit4]    >         at com.fasterxml.jackson.databind.ser.impl.IndexedListSerializer.serializeContents(IndexedListSerializer.java:115)
20-Sep-2019 11:00:38    [junit4]    >         at com.fasterxml.jackson.databind.ser.impl.IndexedListSerializer.serialize(IndexedListSerializer.java:79)
20-Sep-2019 11:00:38    [junit4]    >         at com.fasterxml.jackson.databind.ser.impl.IndexedListSerializer.serialize(IndexedListSerializer.java:18)
20-Sep-2019 11:00:38    [junit4]    >         at com.fasterxml.jackson.databind.ser.std.MapSerializer.serializeFields(MapSerializer.java:722)
20-Sep-2019 11:00:38    [junit4]    >         at com.fasterxml.jackson.databind.ser.std.MapSerializer.serialize(MapSerializer.java:643)
20-Sep-2019 11:00:38    [junit4]    >         at com.fasterxml.jackson.databind.ser.std.MapSerializer.serialize(MapSerializer.java:33)
20-Sep-2019 11:00:38    [junit4]    >         at com.fasterxml.jackson.databind.ser.DefaultSerializerProvider._serialize(DefaultSerializerProvider.java:480)
20-Sep-2019 11:00:38    [junit4]    >         at com.fasterxml.jackson.databind.ser.DefaultSerializerProvider.serializeValue(DefaultSerializerProvider.java:319)
20-Sep-2019 11:00:38    [junit4]    >         at com.fasterxml.jackson.databind.ObjectMapper._configAndWriteValue(ObjectMapper.java:3906)
20-Sep-2019 11:00:38    [junit4]    >         at com.fasterxml.jackson.databind.ObjectMapper.writeValue(ObjectMapper.java:3202)
20-Sep-2019 11:00:38    [junit4]    >         at org.carrot2.core.ProcessingResult.serializeJson(ProcessingResult.java:483)
20-Sep-2019 11:00:38    [junit4]    >         at org.carrot2.core.ProcessingResultTest.getJsonString(ProcessingResultTest.java:388)
20-Sep-2019 11:00:38    [junit4]    >         at org.carrot2.core.ProcessingResultTest.getJsonRootNode(ProcessingResultTest.java:375)
20-Sep-2019 11:00:38    [junit4]    >         at org.carrot2.core.ProcessingResultTest.testJsonSerializationAll(ProcessingResultTest.java:259)
20-Sep-2019 11:00:38    [junit4]    >         at sun.reflect.NativeMethodAccessorImpl.invoke0(Native Method)
20-Sep-2019 11:00:38    [junit4]    >         at sun.reflect.NativeMethodAccessorImpl.invoke(NativeMethodAccessorImpl.java:57)
20-Sep-2019 11:00:38    [junit4]    >         at sun.reflect.DelegatingMethodAccessorImpl.invoke(DelegatingMethodAccessorImpl.java:43)
20-Sep-2019 11:00:38    [junit4]    >         at java.lang.reflect.Method.invoke(Method.java:606)
20-Sep-2019 11:00:38    [junit4]    >         at com.carrotsearch.randomizedtesting.RandomizedRunner.invoke(RandomizedRunner.java:1713)
20-Sep-2019 11:00:38    [junit4]    >         at com.carrotsearch.randomizedtesting.RandomizedRunner$8.evaluate(RandomizedRunner.java:907)
20-Sep-2019 11:00:38    [junit4]    >         at com.carrotsearch.randomizedtesting.rules.SystemPropertiesInvariantRule$1.evaluate(SystemPropertiesInvariantRule.java:59)
20-Sep-2019 11:00:38    [junit4]    >         at com.carrotsearch.randomizedtesting.rules.StatementAdapter.evaluate(StatementAdapter.java:36)
20-Sep-2019 11:00:38    [junit4]    >         at com.carrotsearch.randomizedtesting.ThreadLeakControl$StatementRunner.run(ThreadLeakControl.java:367)
20-Sep-2019 11:00:38    [junit4]    >         at com.carrotsearch.randomizedtesting.ThreadLeakControl.forkTimeoutingTask(ThreadLeakControl.java:811)
20-Sep-2019 11:00:38    [junit4]    >         at com.carrotsearch.randomizedtesting.ThreadLeakControl$3.evaluate(ThreadLeakControl.java:462)
20-Sep-2019 11:00:38    [junit4]    >         at com.carrotsearch.randomizedtesting.RandomizedRunner.runSingleTest(RandomizedRunner.java:916)
20-Sep-2019 11:00:38    [junit4]    >         at com.carrotsearch.randomizedtesting.RandomizedRunner$5.evaluate(RandomizedRunner.java:802)
20-Sep-2019 11:00:38    [junit4]    >         at com.carrotsearch.randomizedtesting.RandomizedRunner$6.evaluate(RandomizedRunner.java:852)
20-Sep-2019 11:00:38    [junit4]    >         at com.carrotsearch.randomizedtesting.RandomizedRunner$7.evaluate(RandomizedRunner.java:863)
20-Sep-2019 11:00:38    [junit4]    >         at com.carrotsearch.randomizedtesting.rules.NoShadowingOrOverridesOnMethodsRule$1.evaluate(NoShadowingOrOverridesOnMethodsRule.java:40)
20-Sep-2019 11:00:38    [junit4]    >         at com.carrotsearch.randomizedtesting.rules.NoShadowingOrOverridesOnMethodsRule$1.evaluate(NoShadowingOrOverridesOnMethodsRule.java:40)
20-Sep-2019 11:00:38    [junit4]    >         at com.carrotsearch.randomizedtesting.rules.SystemPropertiesInvariantRule$1.evaluate(SystemPropertiesInvariantRule.java:59)
20-Sep-2019 11:00:38    [junit4]    >         at com.carrotsearch.randomizedtesting.rules.StatementAdapter.evaluate(StatementAdapter.java:36)
20-Sep-2019 11:00:38    [junit4]    >         at com.carrotsearch.randomizedtesting.ThreadLeakControl$StatementRunner.run(ThreadLeakControl.java:367)
20-Sep-2019 11:00:38    [junit4]    >         at java.lang.Thread.run(Thread.java:745)
20-Sep-2019 11:00:38    [junit4] ERROR   0.00s J1 | ProcessingResultTest.deserializeStringDocumentIds <<<
20-Sep-2019 11:00:38    [junit4]    > Throwable #1: java.lang.UnsupportedClassVersionError: org/simpleframework/xml/core/Persister
20-Sep-2019 11:00:38    [junit4]    >         at __randomizedtesting.SeedInfo.seed([D0B241FC88C4131E:9A37EBA767ED7ED9]:0)
20-Sep-2019 11:00:38    [junit4]    >         at org.carrot2.core.ProcessingResult.deserialize(ProcessingResult.java:372)
20-Sep-2019 11:00:38    [junit4]    >         at org.carrot2.core.ProcessingResultTest.deserializeStringDocumentIds(ProcessingResultTest.java:125)
20-Sep-2019 11:00:38    [junit4]    >         at sun.reflect.NativeMethodAccessorImpl.invoke0(Native Method)
20-Sep-2019 11:00:38    [junit4]    >         at sun.reflect.NativeMethodAccessorImpl.invoke(NativeMethodAccessorImpl.java:57)
20-Sep-2019 11:00:38    [junit4]    >         at sun.reflect.DelegatingMethodAccessorImpl.invoke(DelegatingMethodAccessorImpl.java:43)
20-Sep-2019 11:00:38    [junit4]    >         at java.lang.reflect.Method.invoke(Method.java:606)
20-Sep-2019 11:00:38    [junit4]    >         at com.carrotsearch.randomizedtesting.RandomizedRunner.invoke(RandomizedRunner.java:1713)
20-Sep-2019 11:00:38    [junit4]    >         at com.carrotsearch.randomizedtesting.RandomizedRunner$8.evaluate(RandomizedRunner.java:907)
20-Sep-2019 11:00:38    [junit4]    >         at com.carrotsearch.randomizedtesting.rules.SystemPropertiesInvariantRule$1.evaluate(SystemPropertiesInvariantRule.java:59)
20-Sep-2019 11:00:38    [junit4]    >         at com.carrotsearch.randomizedtesting.rules.StatementAdapter.evaluate(StatementAdapter.java:36)
20-Sep-2019 11:00:38    [junit4]    >         at com.carrotsearch.randomizedtesting.ThreadLeakControl$StatementRunner.run(ThreadLeakControl.java:367)
20-Sep-2019 11:00:38    [junit4]    >         at com.carrotsearch.randomizedtesting.ThreadLeakControl.forkTimeoutingTask(ThreadLeakControl.java:811)
20-Sep-2019 11:00:38    [junit4]    >         at com.carrotsearch.randomizedtesting.ThreadLeakControl$3.evaluate(ThreadLeakControl.java:462)
20-Sep-2019 11:00:38    [junit4]    >         at com.carrotsearch.randomizedtesting.RandomizedRunner.runSingleTest(RandomizedRunner.java:916)
20-Sep-2019 11:00:38    [junit4]    >         at com.carrotsearch.randomizedtesting.RandomizedRunner$5.evaluate(RandomizedRunner.java:802)
20-Sep-2019 11:00:38    [junit4]    >         at com.carrotsearch.randomizedtesting.RandomizedRunner$6.evaluate(RandomizedRunner.java:852)
20-Sep-2019 11:00:38    [junit4]    >         at com.carrotsearch.randomizedtesting.RandomizedRunner$7.evaluate(RandomizedRunner.java:863)
20-Sep-2019 11:00:38    [junit4]    >         at com.carrotsearch.randomizedtesting.rules.NoShadowingOrOverridesOnMethodsRule$1.evaluate(NoShadowingOrOverridesOnMethodsRule.java:40)
20-Sep-2019 11:00:38    [junit4]    >         at com.carrotsearch.randomizedtesting.rules.NoShadowingOrOverridesOnMethodsRule$1.evaluate(NoShadowingOrOverridesOnMethodsRule.java:40)
20-Sep-2019 11:00:38    [junit4]    >         at com.carrotsearch.randomizedtesting.rules.SystemPropertiesInvariantRule$1.evaluate(SystemPropertiesInvariantRule.java:59)
20-Sep-2019 11:00:38    [junit4]    >         at com.carrotsearch.randomizedtesting.rules.StatementAdapter.evaluate(StatementAdapter.java:36)
20-Sep-2019 11:00:38    [junit4]    >         at com.carrotsearch.randomizedtesting.ThreadLeakControl$StatementRunner.run(ThreadLeakControl.java:367)
20-Sep-2019 11:00:38    [junit4]    >         at java.lang.Thread.run(Thread.java:745)
20-Sep-2019 11:00:38    [junit4] ERROR   0.00s J1 | ProcessingResultTest.testSerializationDeserializationDocumentsOnly <<<
20-Sep-2019 11:00:38    [junit4]    > Throwable #1: java.lang.UnsupportedClassVersionError: org/simpleframework/xml/core/Persister
20-Sep-2019 11:00:38    [junit4]    >         at __randomizedtesting.SeedInfo.seed([D0B241FC88C4131E:AE557D688E86919D]:0)
20-Sep-2019 11:00:38    [junit4]    >         at org.carrot2.core.ProcessingResult.serialize(ProcessingResult.java:349)
20-Sep-2019 11:00:38    [junit4]    >         at org.carrot2.core.ProcessingResult.serialize(ProcessingResult.java:320)
20-Sep-2019 11:00:38    [junit4]    >         at org.carrot2.core.ProcessingResult.serialize(ProcessingResult.java:297)
20-Sep-2019 11:00:38    [junit4]    >         at org.carrot2.core.ProcessingResultTest.checkSerializationDeserialization(ProcessingResultTest.java:407)
20-Sep-2019 11:00:38    [junit4]    >         at org.carrot2.core.ProcessingResultTest.testSerializationDeserializationDocumentsOnly(ProcessingResultTest.java:61)
20-Sep-2019 11:00:38    [junit4]    >         at sun.reflect.NativeMethodAccessorImpl.invoke0(Native Method)
20-Sep-2019 11:00:38    [junit4]    >         at sun.reflect.NativeMethodAccessorImpl.invoke(NativeMethodAccessorImpl.java:57)
20-Sep-2019 11:00:38    [junit4]    >         at sun.reflect.DelegatingMethodAccessorImpl.invoke(DelegatingMethodAccessorImpl.java:43)
20-Sep-2019 11:00:38    [junit4]    >         at java.lang.reflect.Method.invoke(Method.java:606)
20-Sep-2019 11:00:38    [junit4]    >         at com.carrotsearch.randomizedtesting.RandomizedRunner.invoke(RandomizedRunner.java:1713)
20-Sep-2019 11:00:38    [junit4]    >         at com.carrotsearch.randomizedtesting.RandomizedRunner$8.evaluate(RandomizedRunner.java:907)
20-Sep-2019 11:00:38    [junit4]    >         at com.carrotsearch.randomizedtesting.rules.SystemPropertiesInvariantRule$1.evaluate(SystemPropertiesInvariantRule.java:59)
20-Sep-2019 11:00:38    [junit4]    >         at com.carrotsearch.randomizedtesting.rules.StatementAdapter.evaluate(StatementAdapter.java:36)
20-Sep-2019 11:00:38    [junit4]    >         at com.carrotsearch.randomizedtesting.ThreadLeakControl$StatementRunner.run(ThreadLeakControl.java:367)
20-Sep-2019 11:00:38    [junit4]    >         at com.carrotsearch.randomizedtesting.ThreadLeakControl.forkTimeoutingTask(ThreadLeakControl.java:811)
20-Sep-2019 11:00:38    [junit4]    >         at com.carrotsearch.randomizedtesting.ThreadLeakControl$3.evaluate(ThreadLeakControl.java:462)
20-Sep-2019 11:00:38    [junit4]    >         at com.carrotsearch.randomizedtesting.RandomizedRunner.runSingleTest(RandomizedRunner.java:916)
20-Sep-2019 11:00:38    [junit4]    >         at com.carrotsearch.randomizedtesting.RandomizedRunner$5.evaluate(RandomizedRunner.java:802)
20-Sep-2019 11:00:38    [junit4]    >         at com.carrotsearch.randomizedtesting.RandomizedRunner$6.evaluate(RandomizedRunner.java:852)
20-Sep-2019 11:00:38    [junit4]    >         at com.carrotsearch.randomizedtesting.RandomizedRunner$7.evaluate(RandomizedRunner.java:863)
20-Sep-2019 11:00:38    [junit4]    >         at com.carrotsearch.randomizedtesting.rules.NoShadowingOrOverridesOnMethodsRule$1.evaluate(NoShadowingOrOverridesOnMethodsRule.java:40)
20-Sep-2019 11:00:38    [junit4]    >         at com.carrotsearch.randomizedtesting.rules.NoShadowingOrOverridesOnMethodsRule$1.evaluate(NoShadowingOrOverridesOnMethodsRule.java:40)
20-Sep-2019 11:00:38    [junit4]    >         at com.carrotsearch.randomizedtesting.rules.SystemPropertiesInvariantRule$1.evaluate(SystemPropertiesInvariantRule.java:59)
20-Sep-2019 11:00:38    [junit4]    >         at com.carrotsearch.randomizedtesting.rules.StatementAdapter.evaluate(StatementAdapter.java:36)
20-Sep-2019 11:00:38    [junit4]    >         at com.carrotsearch.randomizedtesting.ThreadLeakControl$StatementRunner.run(ThreadLeakControl.java:367)
20-Sep-2019 11:00:38    [junit4]    >         at java.lang.Thread.run(Thread.java:745)
20-Sep-2019 11:00:38    [junit4] ERROR   0.00s J1 | ProcessingResultTest.testJsonSerializationDocumentsOnly <<<
20-Sep-2019 11:00:38    [junit4]    > Throwable #1: java.lang.UnsupportedClassVersionError: org/simpleframework/xml/Root : Unsupported major.minor version 52.0
20-Sep-2019 11:00:38    [junit4]    >         at __randomizedtesting.SeedInfo.seed([D0B241FC88C4131E:7F866CE900490453]:0)
20-Sep-2019 11:00:38    [junit4]    >         at java.lang.ClassLoader.defineClass1(Native Method)
20-Sep-2019 11:00:38    [junit4]    >         at java.lang.ClassLoader.defineClass(ClassLoader.java:800)
20-Sep-2019 11:00:38    [junit4]    >         at java.security.SecureClassLoader.defineClass(SecureClassLoader.java:142)
20-Sep-2019 11:00:38    [junit4]    >         at java.net.URLClassLoader.defineClass(URLClassLoader.java:449)
20-Sep-2019 11:00:38    [junit4]    >         at java.net.URLClassLoader.access$100(URLClassLoader.java:71)
20-Sep-2019 11:00:38    [junit4]    >         at java.net.URLClassLoader$1.run(URLClassLoader.java:361)
20-Sep-2019 11:00:38    [junit4]    >         at java.net.URLClassLoader$1.run(URLClassLoader.java:355)
20-Sep-2019 11:00:38    [junit4]    >         at java.security.AccessController.doPrivileged(Native Method)
20-Sep-2019 11:00:38    [junit4]    >         at java.net.URLClassLoader.findClass(URLClassLoader.java:354)
20-Sep-2019 11:00:38    [junit4]    >         at java.lang.ClassLoader.loadClass(ClassLoader.java:425)
20-Sep-2019 11:00:38    [junit4]    >         at sun.misc.Launcher$AppClassLoader.loadClass(Launcher.java:308)
20-Sep-2019 11:00:38    [junit4]    >         at java.lang.ClassLoader.loadClass(ClassLoader.java:358)
20-Sep-2019 11:00:38    [junit4]    >         at java.lang.Class.forName0(Native Method)
20-Sep-2019 11:00:38    [junit4]    >         at java.lang.Class.forName(Class.java:278)
20-Sep-2019 11:00:38    [junit4]    >         at sun.reflect.generics.factory.CoreReflectionFactory.makeNamedType(CoreReflectionFactory.java:114)
20-Sep-2019 11:00:38    [junit4]    >         at sun.reflect.generics.visitor.Reifier.visitClassTypeSignature(Reifier.java:125)
20-Sep-2019 11:00:38    [junit4]    >         at sun.reflect.generics.tree.ClassTypeSignature.accept(ClassTypeSignature.java:49)
20-Sep-2019 11:00:38    [junit4]    >         at sun.reflect.annotation.AnnotationParser.parseSig(AnnotationParser.java:432)
20-Sep-2019 11:00:38    [junit4]    >         at sun.reflect.annotation.AnnotationParser.parseAnnotation2(AnnotationParser.java:238)
20-Sep-2019 11:00:38    [junit4]    >         at sun.reflect.annotation.AnnotationParser.parseAnnotations2(AnnotationParser.java:117)
20-Sep-2019 11:00:38    [junit4]    >         at sun.reflect.annotation.AnnotationParser.parseAnnotations(AnnotationParser.java:70)
20-Sep-2019 11:00:38    [junit4]    >         at java.lang.Class.initAnnotationsIfNecessary(Class.java:3281)
20-Sep-2019 11:00:38    [junit4]    >         at java.lang.Class.getDeclaredAnnotations(Class.java:3258)
20-Sep-2019 11:00:38    [junit4]    >         at com.fasterxml.jackson.databind.util.ClassUtil.findClassAnnotations(ClassUtil.java:1095)
20-Sep-2019 11:00:38    [junit4]    >         at com.fasterxml.jackson.databind.introspect.AnnotatedClassResolver.resolveClassAnnotations(AnnotatedClassResolver.java:154)
20-Sep-2019 11:00:38    [junit4]    >         at com.fasterxml.jackson.databind.introspect.AnnotatedClassResolver.resolveFully(AnnotatedClassResolver.java:118)
20-Sep-2019 11:00:38    [junit4]    >         at com.fasterxml.jackson.databind.introspect.AnnotatedClassResolver.resolve(AnnotatedClassResolver.java:69)
20-Sep-2019 11:00:38    [junit4]    >         at com.fasterxml.jackson.databind.introspect.BasicClassIntrospector._resolveAnnotatedClass(BasicClassIntrospector.java:282)
20-Sep-2019 11:00:38    [junit4]    >         at com.fasterxml.jackson.databind.introspect.BasicClassIntrospector.collectProperties(BasicClassIntrospector.java:192)
20-Sep-2019 11:00:38    [junit4]    >         at com.fasterxml.jackson.databind.introspect.BasicClassIntrospector.forSerialization(BasicClassIntrospector.java:92)
20-Sep-2019 11:00:38    [junit4]    >         at com.fasterxml.jackson.databind.introspect.BasicClassIntrospector.forSerialization(BasicClassIntrospector.java:16)
20-Sep-2019 11:00:38    [junit4]    >         at com.fasterxml.jackson.databind.SerializationConfig.introspect(SerializationConfig.java:778)
20-Sep-2019 11:00:38    [junit4]    >         at com.fasterxml.jackson.databind.ser.BeanSerializerFactory.createSerializer(BeanSerializerFactory.java:135)
20-Sep-2019 11:00:38    [junit4]    >         at com.fasterxml.jackson.databind.SerializerProvider._createUntypedSerializer(SerializerProvider.java:1388)
20-Sep-2019 11:00:38    [junit4]    >         at com.fasterxml.jackson.databind.SerializerProvider._createAndCacheUntypedSerializer(SerializerProvider.java:1336)
20-Sep-2019 11:00:38    [junit4]    >         at com.fasterxml.jackson.databind.SerializerProvider.findValueSerializer(SerializerProvider.java:510)
20-Sep-2019 11:00:38    [junit4]    >         at com.fasterxml.jackson.databind.ser.impl.PropertySerializerMap.findAndAddSecondarySerializer(PropertySerializerMap.java:90)
20-Sep-2019 11:00:38    [junit4]    >         at com.fasterxml.jackson.databind.ser.std.AsArraySerializerBase._findAndAddDynamic(AsArraySerializerBase.java:306)
20-Sep-2019 11:00:38    [junit4]    >         at com.fasterxml.jackson.databind.ser.impl.IndexedListSerializer.serializeContents(IndexedListSerializer.java:115)
20-Sep-2019 11:00:38    [junit4]    >         at com.fasterxml.jackson.databind.ser.impl.IndexedListSerializer.serialize(IndexedListSerializer.java:79)
20-Sep-2019 11:00:38    [junit4]    >         at com.fasterxml.jackson.databind.ser.impl.IndexedListSerializer.serialize(IndexedListSerializer.java:18)
20-Sep-2019 11:00:38    [junit4]    >         at com.fasterxml.jackson.databind.ser.std.MapSerializer.serializeFields(MapSerializer.java:722)
20-Sep-2019 11:00:38    [junit4]    >         at com.fasterxml.jackson.databind.ser.std.MapSerializer.serialize(MapSerializer.java:643)
20-Sep-2019 11:00:38    [junit4]    >         at com.fasterxml.jackson.databind.ser.std.MapSerializer.serialize(MapSerializer.java:33)
20-Sep-2019 11:00:38    [junit4]    >         at com.fasterxml.jackson.databind.ser.DefaultSerializerProvider._serialize(DefaultSerializerProvider.java:480)
20-Sep-2019 11:00:38    [junit4]    >         at com.fasterxml.jackson.databind.ser.DefaultSerializerProvider.serializeValue(DefaultSerializerProvider.java:319)
20-Sep-2019 11:00:38    [junit4]    >         at com.fasterxml.jackson.databind.ObjectMapper._configAndWriteValue(ObjectMapper.java:3906)
20-Sep-2019 11:00:38    [junit4]    >         at com.fasterxml.jackson.databind.ObjectMapper.writeValue(ObjectMapper.java:3202)
20-Sep-2019 11:00:38    [junit4]    >         at org.carrot2.core.ProcessingResult.serializeJson(ProcessingResult.java:483)
20-Sep-2019 11:00:38    [junit4]    >         at org.carrot2.core.ProcessingResultTest.getJsonString(ProcessingResultTest.java:388)
20-Sep-2019 11:00:38    [junit4]    >         at org.carrot2.core.ProcessingResultTest.getJsonRootNode(ProcessingResultTest.java:375)
20-Sep-2019 11:00:38    [junit4]    >         at org.carrot2.core.ProcessingResultTest.testJsonSerializationDocumentsOnly(ProcessingResultTest.java:293)
20-Sep-2019 11:00:38    [junit4]    >         at sun.reflect.NativeMethodAccessorImpl.invoke0(Native Method)
20-Sep-2019 11:00:38    [junit4]    >         at sun.reflect.NativeMethodAccessorImpl.invoke(NativeMethodAccessorImpl.java:57)
20-Sep-2019 11:00:38    [junit4]    >         at sun.reflect.DelegatingMethodAccessorImpl.invoke(DelegatingMethodAccessorImpl.java:43)
20-Sep-2019 11:00:38    [junit4]    >         at java.lang.reflect.Method.invoke(Method.java:606)
20-Sep-2019 11:00:38    [junit4]    >         at com.carrotsearch.randomizedtesting.RandomizedRunner.invoke(RandomizedRunner.java:1713)
20-Sep-2019 11:00:38    [junit4]    >         at com.carrotsearch.randomizedtesting.RandomizedRunner$8.evaluate(RandomizedRunner.java:907)
20-Sep-2019 11:00:38    [junit4]    >         at com.carrotsearch.randomizedtesting.rules.SystemPropertiesInvariantRule$1.evaluate(SystemPropertiesInvariantRule.java:59)
20-Sep-2019 11:00:38    [junit4]    >         at com.carrotsearch.randomizedtesting.rules.StatementAdapter.evaluate(StatementAdapter.java:36)
20-Sep-2019 11:00:38    [junit4]    >         at com.carrotsearch.randomizedtesting.ThreadLeakControl$StatementRunner.run(ThreadLeakControl.java:367)
20-Sep-2019 11:00:38    [junit4]    >         at com.carrotsearch.randomizedtesting.ThreadLeakControl.forkTimeoutingTask(ThreadLeakControl.java:811)
20-Sep-2019 11:00:38    [junit4]    >         at com.carrotsearch.randomizedtesting.ThreadLeakControl$3.evaluate(ThreadLeakControl.java:462)
20-Sep-2019 11:00:38    [junit4]    >         at com.carrotsearch.randomizedtesting.RandomizedRunner.runSingleTest(RandomizedRunner.java:916)
20-Sep-2019 11:00:38    [junit4]    >         at com.carrotsearch.randomizedtesting.RandomizedRunner$5.evaluate(RandomizedRunner.java:802)
20-Sep-2019 11:00:38    [junit4]    >         at com.carrotsearch.randomizedtesting.RandomizedRunner$6.evaluate(RandomizedRunner.java:852)
20-Sep-2019 11:00:38    [junit4]    >         at com.carrotsearch.randomizedtesting.RandomizedRunner$7.evaluate(RandomizedRunner.java:863)
20-Sep-2019 11:00:38    [junit4]    >         at com.carrotsearch.randomizedtesting.rules.NoShadowingOrOverridesOnMethodsRule$1.evaluate(NoShadowingOrOverridesOnMethodsRule.java:40)
20-Sep-2019 11:00:38    [junit4]    >         at com.carrotsearch.randomizedtesting.rules.NoShadowingOrOverridesOnMethodsRule$1.evaluate(NoShadowingOrOverridesOnMethodsRule.java:40)
20-Sep-2019 11:00:38    [junit4]    >         at com.carrotsearch.randomizedtesting.rules.SystemPropertiesInvariantRule$1.evaluate(SystemPropertiesInvariantRule.java:59)
20-Sep-2019 11:00:38    [junit4]    >         at com.carrotsearch.randomizedtesting.rules.StatementAdapter.evaluate(StatementAdapter.java:36)
20-Sep-2019 11:00:38    [junit4]    >         at com.carrotsearch.randomizedtesting.ThreadLeakControl$StatementRunner.run(ThreadLeakControl.java:367)
20-Sep-2019 11:00:38    [junit4]    >         at java.lang.Thread.run(Thread.java:745)
20-Sep-2019 11:00:38    [junit4] ERROR   0.00s J1 | ProcessingResultTest.testDocumentDeserializationFromLegacyXml <<<
20-Sep-2019 11:00:38    [junit4]    > Throwable #1: java.lang.UnsupportedClassVersionError: org/simpleframework/xml/core/Persister
20-Sep-2019 11:00:38    [junit4]    >         at __randomizedtesting.SeedInfo.seed([D0B241FC88C4131E:4B79BE13999F8B]:0)
20-Sep-2019 11:00:38    [junit4]    >         at org.carrot2.core.ProcessingResult.deserialize(ProcessingResult.java:372)
20-Sep-2019 11:00:38    [junit4]    >         at org.carrot2.core.ProcessingResultTest.testDocumentDeserializationFromLegacyXml(ProcessingResultTest.java:95)
20-Sep-2019 11:00:38    [junit4]    >         at sun.reflect.NativeMethodAccessorImpl.invoke0(Native Method)
20-Sep-2019 11:00:38    [junit4]    >         at sun.reflect.NativeMethodAccessorImpl.invoke(NativeMethodAccessorImpl.java:57)
20-Sep-2019 11:00:38    [junit4]    >         at sun.reflect.DelegatingMethodAccessorImpl.invoke(DelegatingMethodAccessorImpl.java:43)
20-Sep-2019 11:00:38    [junit4]    >         at java.lang.reflect.Method.invoke(Method.java:606)
20-Sep-2019 11:00:38    [junit4]    >         at com.carrotsearch.randomizedtesting.RandomizedRunner.invoke(RandomizedRunner.java:1713)
20-Sep-2019 11:00:38    [junit4]    >         at com.carrotsearch.randomizedtesting.RandomizedRunner$8.evaluate(RandomizedRunner.java:907)
20-Sep-2019 11:00:38    [junit4]    >         at com.carrotsearch.randomizedtesting.rules.SystemPropertiesInvariantRule$1.evaluate(SystemPropertiesInvariantRule.java:59)
20-Sep-2019 11:00:38    [junit4]    >         at com.carrotsearch.randomizedtesting.rules.StatementAdapter.evaluate(StatementAdapter.java:36)
20-Sep-2019 11:00:38    [junit4]    >         at com.carrotsearch.randomizedtesting.ThreadLeakControl$StatementRunner.run(ThreadLeakControl.java:367)
20-Sep-2019 11:00:38    [junit4]    >         at com.carrotsearch.randomizedtesting.ThreadLeakControl.forkTimeoutingTask(ThreadLeakControl.java:811)
20-Sep-2019 11:00:38    [junit4]    >         at com.carrotsearch.randomizedtesting.ThreadLeakControl$3.evaluate(ThreadLeakControl.java:462)
20-Sep-2019 11:00:38    [junit4]    >         at com.carrotsearch.randomizedtesting.RandomizedRunner.runSingleTest(RandomizedRunner.java:916)
20-Sep-2019 11:00:38    [junit4]    >         at com.carrotsearch.randomizedtesting.RandomizedRunner$5.evaluate(RandomizedRunner.java:802)
20-Sep-2019 11:00:38    [junit4]    >         at com.carrotsearch.randomizedtesting.RandomizedRunner$6.evaluate(RandomizedRunner.java:852)
20-Sep-2019 11:00:38    [junit4]    >         at com.carrotsearch.randomizedtesting.RandomizedRunner$7.evaluate(RandomizedRunner.java:863)
20-Sep-2019 11:00:38    [junit4]    >         at com.carrotsearch.randomizedtesting.rules.NoShadowingOrOverridesOnMethodsRule$1.evaluate(NoShadowingOrOverridesOnMethodsRule.java:40)
20-Sep-2019 11:00:38    [junit4]    >         at com.carrotsearch.randomizedtesting.rules.NoShadowingOrOverridesOnMethodsRule$1.evaluate(NoShadowingOrOverridesOnMethodsRule.java:40)
20-Sep-2019 11:00:38    [junit4]    >         at com.carrotsearch.randomizedtesting.rules.SystemPropertiesInvariantRule$1.evaluate(SystemPropertiesInvariantRule.java:59)
20-Sep-2019 11:00:38    [junit4]    >         at com.carrotsearch.randomizedtesting.rules.StatementAdapter.evaluate(StatementAdapter.java:36)
20-Sep-2019 11:00:38    [junit4]    >         at com.carrotsearch.randomizedtesting.ThreadLeakControl$StatementRunner.run(ThreadLeakControl.java:367)
20-Sep-2019 11:00:38    [junit4]    >         at java.lang.Thread.run(Thread.java:745)
20-Sep-2019 11:00:38    [junit4] ERROR   0.00s J1 | ProcessingResultTest.testDocumentDeserializationLanguageByEnumCode <<<
20-Sep-2019 11:00:38    [junit4]    > Throwable #1: java.lang.UnsupportedClassVersionError: org/simpleframework/xml/core/Persister
20-Sep-2019 11:00:38    [junit4]    >         at __randomizedtesting.SeedInfo.seed([D0B241FC88C4131E:EB24CE5D74A13297]:0)
20-Sep-2019 11:00:38    [junit4]    >         at org.carrot2.core.ProcessingResult.deserialize(ProcessingResult.java:372)
20-Sep-2019 11:00:38    [junit4]    >         at org.carrot2.core.ProcessingResultTest.testDocumentDeserializationLanguageByEnumCode(ProcessingResultTest.java:151)
20-Sep-2019 11:00:38    [junit4]    >         at sun.reflect.NativeMethodAccessorImpl.invoke0(Native Method)
20-Sep-2019 11:00:38    [junit4]    >         at sun.reflect.NativeMethodAccessorImpl.invoke(NativeMethodAccessorImpl.java:57)
20-Sep-2019 11:00:38    [junit4]    >         at sun.reflect.DelegatingMethodAccessorImpl.invoke(DelegatingMethodAccessorImpl.java:43)
20-Sep-2019 11:00:38    [junit4]    >         at java.lang.reflect.Method.invoke(Method.java:606)
20-Sep-2019 11:00:38    [junit4]    >         at com.carrotsearch.randomizedtesting.RandomizedRunner.invoke(RandomizedRunner.java:1713)
20-Sep-2019 11:00:38    [junit4]    >         at com.carrotsearch.randomizedtesting.RandomizedRunner$8.evaluate(RandomizedRunner.java:907)
20-Sep-2019 11:00:38    [junit4]    >         at com.carrotsearch.randomizedtesting.rules.SystemPropertiesInvariantRule$1.evaluate(SystemPropertiesInvariantRule.java:59)
20-Sep-2019 11:00:38    [junit4]    >         at com.carrotsearch.randomizedtesting.rules.StatementAdapter.evaluate(StatementAdapter.java:36)
20-Sep-2019 11:00:38    [junit4]    >         at com.carrotsearch.randomizedtesting.ThreadLeakControl$StatementRunner.run(ThreadLeakControl.java:367)
20-Sep-2019 11:00:38    [junit4]    >         at com.carrotsearch.randomizedtesting.ThreadLeakControl.forkTimeoutingTask(ThreadLeakControl.java:811)
20-Sep-2019 11:00:38    [junit4]    >         at com.carrotsearch.randomizedtesting.ThreadLeakControl$3.evaluate(ThreadLeakControl.java:462)
20-Sep-2019 11:00:38    [junit4]    >         at com.carrotsearch.randomizedtesting.RandomizedRunner.runSingleTest(RandomizedRunner.java:916)
20-Sep-2019 11:00:38    [junit4]    >         at com.carrotsearch.randomizedtesting.RandomizedRunner$5.evaluate(RandomizedRunner.java:802)
20-Sep-2019 11:00:38    [junit4]    >         at com.carrotsearch.randomizedtesting.RandomizedRunner$6.evaluate(RandomizedRunner.java:852)
20-Sep-2019 11:00:38    [junit4]    >         at com.carrotsearch.randomizedtesting.RandomizedRunner$7.evaluate(RandomizedRunner.java:863)
20-Sep-2019 11:00:38    [junit4]    >         at com.carrotsearch.randomizedtesting.rules.NoShadowingOrOverridesOnMethodsRule$1.evaluate(NoShadowingOrOverridesOnMethodsRule.java:40)
20-Sep-2019 11:00:38    [junit4]    >         at com.carrotsearch.randomizedtesting.rules.NoShadowingOrOverridesOnMethodsRule$1.evaluate(NoShadowingOrOverridesOnMethodsRule.java:40)
20-Sep-2019 11:00:38    [junit4]    >         at com.carrotsearch.randomizedtesting.rules.SystemPropertiesInvariantRule$1.evaluate(SystemPropertiesInvariantRule.java:59)
20-Sep-2019 11:00:38    [junit4]    >         at com.carrotsearch.randomizedtesting.rules.StatementAdapter.evaluate(StatementAdapter.java:36)
20-Sep-2019 11:00:38    [junit4]    >         at com.carrotsearch.randomizedtesting.ThreadLeakControl$StatementRunner.run(ThreadLeakControl.java:367)
20-Sep-2019 11:00:38    [junit4]    >         at java.lang.Thread.run(Thread.java:745)
20-Sep-2019 11:00:38    [junit4] Completed [47/95 (7!)] on J1 in 0.16s, 15 tests, 14 errors <<< FAILURES!
20-Sep-2019 11:00:38    [junit4]
20-Sep-2019 11:00:38    [junit4] Suite: org.carrot2.util.httpclient.HttpClientFactoryTest
20-Sep-2019 11:00:38    [junit4] Completed [48/95 (7!)] on J2 in 0.89s, 1 test
20-Sep-2019 11:00:38    [junit4]
20-Sep-2019 11:00:38    [junit4] Suite: org.carrot2.util.RollingWindowAverageTest
20-Sep-2019 11:00:38    [junit4] Completed [49/95 (7!)] on J1 in 0.02s, 3 tests
20-Sep-2019 11:00:38    [junit4]
20-Sep-2019 11:00:38    [junit4] Suite: org.carrot2.text.preprocessing.filter.StopWordLabelFilterMergedTest
20-Sep-2019 11:00:38    [junit4] Completed [50/95 (7!)] on J2 in 0.06s, 4 tests
20-Sep-2019 11:00:38    [junit4]
20-Sep-2019 11:00:38    [junit4] Suite: org.carrot2.source.microsoft.v7.Bing7DocumentSourceTest
20-Sep-2019 11:00:38    [junit4] IGNOR/A 0.00s J1 | Bing7DocumentSourceTest.testInCachingController
20-Sep-2019 11:00:38    [junit4]    > Assumption #1: 'usesexternalservices' test group is disabled (@UsesExternalServices())
20-Sep-2019 11:00:38    [junit4] IGNOR/A 0.00s J1 | Bing7DocumentSourceTest.testResultsTotal
20-Sep-2019 11:00:38    [junit4]    > Assumption #1: 'usesexternalservices' test group is disabled (@UsesExternalServices())
20-Sep-2019 11:00:38    [junit4] IGNOR/A 0.00s J1 | Bing7DocumentSourceTest.testQueryLargerThanPage
20-Sep-2019 11:00:38    [junit4]    > Assumption #1: 'usesexternalservices' test group is disabled (@UsesExternalServices())
20-Sep-2019 11:00:38    [junit4] IGNOR/A 0.02s J1 | Bing7DocumentSourceTest.testLargeQuery
20-Sep-2019 11:00:38    [junit4]    > Assumption #1: 'usesexternalservices' test group is disabled (@UsesExternalServices())
20-Sep-2019 11:00:38    [junit4] IGNOR/A 0.00s J1 | Bing7DocumentSourceTest.testNoResultsQuery
20-Sep-2019 11:00:38    [junit4]    > Assumption #1: 'usesexternalservices' test group is disabled (@UsesExternalServices())
20-Sep-2019 11:00:38    [junit4] IGNOR/A 0.00s J1 | Bing7DocumentSourceTest.testConservativeMode
20-Sep-2019 11:00:38    [junit4]    > Assumption #1: 'usesexternalservices' test group is disabled (@UsesExternalServices())
20-Sep-2019 11:00:38    [junit4] IGNOR/A 0.00s J1 | Bing7DocumentSourceTest.testURLsUnique
20-Sep-2019 11:00:38    [junit4]    > Assumption #1: 'usesexternalservices' test group is disabled (@UsesExternalServices())
20-Sep-2019 11:00:38    [junit4] IGNOR/A 0.00s J1 | Bing7DocumentSourceTest.testSmallQuery
20-Sep-2019 11:00:38    [junit4]    > Assumption #1: 'usesexternalservices' test group is disabled (@UsesExternalServices())
20-Sep-2019 11:00:38    [junit4] IGNOR/A 0.00s J1 | Bing7DocumentSourceTest.testSpeculativeMode
20-Sep-2019 11:00:38    [junit4]    > Assumption #1: 'usesexternalservices' test group is disabled (@UsesExternalServices())
20-Sep-2019 11:00:38    [junit4] IGNOR/A 0.00s J1 | Bing7DocumentSourceTest.testHtmlUnescaping
20-Sep-2019 11:00:38    [junit4]    > Assumption #1: 'usesexternalservices' test group is disabled (@UsesExternalServices())
20-Sep-2019 11:00:38    [junit4] IGNOR/A 0.00s J1 | Bing7DocumentSourceTest.testUtfCharacters
20-Sep-2019 11:00:38    [junit4]    > Assumption #1: 'usesexternalservices' test group is disabled (@UsesExternalServices())
20-Sep-2019 11:00:38    [junit4] IGNOR/A 0.00s J1 | Bing7DocumentSourceTest.testMetadataAvailable
20-Sep-2019 11:00:38    [junit4]    > Assumption #1: 'usesexternalservices' test group is disabled (@UsesExternalServices())
20-Sep-2019 11:00:38    [junit4] Completed [51/95 (7!)] on J1 in 0.02s, 12 tests, 12 skipped
20-Sep-2019 11:00:38    [junit4]
20-Sep-2019 11:00:38    [junit4] Suite: org.carrot2.source.SearchRangeTest
20-Sep-2019 11:00:38    [junit4] Completed [52/95 (7!)] on J2 in 0.02s, 12 tests
20-Sep-2019 11:00:38    [junit4]
20-Sep-2019 11:00:38    [junit4] Suite: org.carrot2.text.preprocessing.filter.CompleteLabelFilterTest
20-Sep-2019 11:00:38    [junit4] Completed [53/95 (7!)] on J1 in 0.02s, 7 tests
20-Sep-2019 11:00:38    [junit4]
20-Sep-2019 11:00:38    [junit4] Suite: org.carrot2.matrix.MatrixUtilsTest
20-Sep-2019 11:00:38    [junit4] Completed [54/95 (7!)] on J2 in 0.03s, 16 tests
20-Sep-2019 11:00:38    [junit4]
20-Sep-2019 11:00:38    [junit4] Suite: org.carrot2.text.preprocessing.StemmerEnglishTest
20-Sep-2019 11:00:38    [junit4] Completed [55/95 (7!)] on J2 in 0.02s, 3 tests
20-Sep-2019 11:00:38    [junit4]
20-Sep-2019 11:00:38    [junit4] Suite: org.carrot2.source.pubmed.PubMedDocumentSourceTest
20-Sep-2019 11:00:38    [junit4] IGNOR/A 0.00s J2 | PubMedDocumentSourceTest.testInCachingController
20-Sep-2019 11:00:38    [junit4]    > Assumption #1: 'usesexternalservices' test group is disabled (@UsesExternalServices())
20-Sep-2019 11:00:38    [junit4] IGNOR/A 0.00s J2 | PubMedDocumentSourceTest.testURLsUnique
20-Sep-2019 11:00:38    [junit4]    > Assumption #1: 'usesexternalservices' test group is disabled (@UsesExternalServices())
20-Sep-2019 11:00:38    [junit4] IGNOR/A 0.00s J2 | PubMedDocumentSourceTest.testSmallQuery
20-Sep-2019 11:00:38    [junit4]    > Assumption #1: 'usesexternalservices' test group is disabled (@UsesExternalServices())
20-Sep-2019 11:00:38    [junit4] IGNOR/A 0.00s J2 | PubMedDocumentSourceTest.testHtmlUnescaping
20-Sep-2019 11:00:38    [junit4]    > Assumption #1: 'usesexternalservices' test group is disabled (@UsesExternalServices())
20-Sep-2019 11:00:38    [junit4] IGNOR/A 0.00s J2 | PubMedDocumentSourceTest.testUtfCharacters
20-Sep-2019 11:00:38    [junit4]    > Assumption #1: 'usesexternalservices' test group is disabled (@UsesExternalServices())
20-Sep-2019 11:00:38    [junit4] IGNOR/A 0.00s J2 | PubMedDocumentSourceTest.testLargeQuery
20-Sep-2019 11:00:38    [junit4]    > Assumption #1: 'usesexternalservices' test group is disabled (@UsesExternalServices())
20-Sep-2019 11:00:38    [junit4] IGNOR/A 0.00s J2 | PubMedDocumentSourceTest.testResultsTotal
20-Sep-2019 11:00:38    [junit4]    > Assumption #1: 'usesexternalservices' test group is disabled (@UsesExternalServices())
20-Sep-2019 11:00:38    [junit4] IGNOR/A 0.00s J2 | PubMedDocumentSourceTest.testNoResultsQuery
20-Sep-2019 11:00:38    [junit4]    > Assumption #1: 'usesexternalservices' test group is disabled (@UsesExternalServices())
20-Sep-2019 11:00:38    [junit4] Completed [56/95 (7!)] on J2 in 0.02s, 9 tests, 8 skipped
20-Sep-2019 11:00:38    [junit4]
20-Sep-2019 11:00:38    [junit4] Suite: org.carrot2.text.preprocessing.filter.NumericLabelFilterTest
20-Sep-2019 11:00:38    [junit4] Completed [57/95 (7!)] on J2 in 0.00s, 5 tests
20-Sep-2019 11:00:38    [junit4]
20-Sep-2019 11:00:38    [junit4] Suite: org.carrot2.text.preprocessing.filter.StopLabelFilterEnglishTest
20-Sep-2019 11:00:38    [junit4] Completed [58/95 (7!)] on J2 in 0.02s, 4 tests
20-Sep-2019 11:00:38    [junit4]
20-Sep-2019 11:00:38    [junit4] Suite: org.carrot2.text.vsm.TermDocumentMatrixBuilderTest
20-Sep-2019 11:00:38    [junit4] Completed [59/95 (7!)] on J2 in 0.02s, 8 tests
20-Sep-2019 11:00:38    [junit4]
20-Sep-2019 11:00:38    [junit4] Suite: org.carrot2.util.attribute.AttributeValueSetTest
20-Sep-2019 11:00:38    [junit4] Completed [60/95 (7!)] on J2 in 0.02s, 3 tests
20-Sep-2019 11:00:38    [junit4]
20-Sep-2019 11:00:39    [junit4] Suite: org.carrot2.clustering.lingo.LingoClusteringAlgorithmTest
20-Sep-2019 11:00:39    [junit4] IGNOR/A 0.00s J1 | LingoClusteringAlgorithmTest.testStress
20-Sep-2019 11:00:39    [junit4]    > Assumption #1: 'nightly' test group is disabled (@Nightly(value=))
20-Sep-2019 11:00:39    [junit4] Completed [61/95 (7!)] on J1 in 0.41s, 10 tests, 1 skipped
20-Sep-2019 11:00:39    [junit4]
20-Sep-2019 11:00:39    [junit4] Suite: org.carrot2.util.pool.FixedSizePoolTest
20-Sep-2019 11:00:39    [junit4] Completed [62/95 (7!)] on J3 in 1.44s, 7 tests
20-Sep-2019 11:00:39    [junit4]
20-Sep-2019 11:00:39    [junit4] Suite: org.carrot2.text.preprocessing.SuffixSorterTest
20-Sep-2019 11:00:39    [junit4] Completed [63/95 (7!)] on J3 in 0.02s, 7 tests
20-Sep-2019 11:00:39    [junit4]
20-Sep-2019 11:00:39    [junit4] Suite: org.carrot2.text.suffixtree.SuffixTreeTest
20-Sep-2019 11:00:39    [junit4] Completed [64/95 (7!)] on J3 in 0.16s, 9 tests
20-Sep-2019 11:00:39    [junit4]
20-Sep-2019 11:00:39    [junit4] Suite: org.carrot2.util.pool.SoftUnboundedPoolTest
20-Sep-2019 11:00:39    [junit4] Completed [65/95 (7!)] on J2 in 0.66s, 6 tests
20-Sep-2019 11:00:39    [junit4]
20-Sep-2019 11:00:39    [junit4] Suite: org.carrot2.core.ControllerTest
20-Sep-2019 11:00:39    [junit4] IGNOR/A 0.00s J0 | ControllerTest$SimpleControllerCommonTests.testNormalExecutionTimeMeasurement
20-Sep-2019 11:00:39    [junit4]    > Assumption #1: 'nightly' test group is disabled (@Nightly(value=))
20-Sep-2019 11:00:39    [junit4] IGNOR/A 0.00s J0 | ControllerTest$SimpleControllerCommonTests.testStress
20-Sep-2019 11:00:39    [junit4]    > Assumption #1: 'nightly' test group is disabled (@Nightly(value=))
20-Sep-2019 11:00:39    [junit4] IGNOR/A 0.00s J0 | ControllerTest$PoolingControllerCommonTests.testNormalExecutionTimeMeasurement
20-Sep-2019 11:00:39    [junit4]    > Assumption #1: 'nightly' test group is disabled (@Nightly(value=))
20-Sep-2019 11:00:39    [junit4] IGNOR/A 0.00s J0 | ControllerTest$PoolingControllerCommonTests.testStress
20-Sep-2019 11:00:39    [junit4]    > Assumption #1: 'nightly' test group is disabled (@Nightly(value=))
20-Sep-2019 11:00:39    [junit4] IGNOR/A 0.00s J0 | ControllerTest$CachingPoolingControllerCachingOffCommonTests.testNormalExecutionTimeMeasurement
20-Sep-2019 11:00:39    [junit4]    > Assumption #1: 'nightly' test group is disabled (@Nightly(value=))
20-Sep-2019 11:00:39    [junit4] IGNOR/A 0.00s J0 | ControllerTest$CachingPoolingControllerCachingOffCommonTests.testStress
20-Sep-2019 11:00:39    [junit4]    > Assumption #1: 'nightly' test group is disabled (@Nightly(value=))
20-Sep-2019 11:00:39    [junit4] IGNOR/A 0.00s J0 | ControllerTest$CachingPoolingControllerCachingOnCommonTests.testNormalExecutionTimeMeasurement
20-Sep-2019 11:00:39    [junit4]    > Assumption #1: 'nightly' test group is disabled (@Nightly(value=))
20-Sep-2019 11:00:39    [junit4] IGNOR/A 0.00s J0 | ControllerTest$CachingPoolingControllerCachingOnCommonTests.testStress
20-Sep-2019 11:00:39    [junit4]    > Assumption #1: 'nightly' test group is disabled (@Nightly(value=))
20-Sep-2019 11:00:39    [junit4] IGNOR/A 0.00s J0 | ControllerTest$CachingControllerCachingOffCommonTests.testNormalExecutionTimeMeasurement
20-Sep-2019 11:00:39    [junit4]    > Assumption #1: 'nightly' test group is disabled (@Nightly(value=))
20-Sep-2019 11:00:39    [junit4] IGNOR/A 0.00s J0 | ControllerTest$CachingControllerCachingOffCommonTests.testStress
20-Sep-2019 11:00:39    [junit4]    > Assumption #1: 'nightly' test group is disabled (@Nightly(value=))
20-Sep-2019 11:00:39    [junit4] IGNOR/A 0.00s J0 | ControllerTest$CachingControllerCachingOnCommonTests.testNormalExecutionTimeMeasurement
20-Sep-2019 11:00:39    [junit4]    > Assumption #1: 'nightly' test group is disabled (@Nightly(value=))
20-Sep-2019 11:00:39    [junit4] IGNOR/A 0.00s J0 | ControllerTest$CachingControllerCachingOnCommonTests.testStress
20-Sep-2019 11:00:39    [junit4]    > Assumption #1: 'nightly' test group is disabled (@Nightly(value=))
20-Sep-2019 11:00:39    [junit4] Completed [66/95 (7!)] on J0 in 1.72s, 207 tests, 14 skipped
20-Sep-2019 11:00:39    [junit4]
20-Sep-2019 11:00:39    [junit4] Suite: org.carrot2.util.ExceptionUtilsTest
20-Sep-2019 11:00:39    [junit4] Completed [67/95 (7!)] on J0 in 0.02s, 5 tests
20-Sep-2019 11:00:39    [junit4]
20-Sep-2019 11:00:39    [junit4] Suite: org.carrot2.core.DocumentTest
20-Sep-2019 11:00:39    [junit4] Completed [68/95 (7!)] on J0 in 0.00s, 3 tests
20-Sep-2019 11:00:39    [junit4]
20-Sep-2019 11:00:39    [junit4] Suite: org.carrot2.text.linguistic.DefaultLexicalDataFactoryTest
20-Sep-2019 11:00:39    [junit4] Completed [69/95 (7!)] on J2 in 0.20s, 3 tests
20-Sep-2019 11:00:39    [junit4]
20-Sep-2019 11:00:40    [junit4] Suite: org.carrot2.clustering.stc.STCClusteringAlgorithmTest
20-Sep-2019 11:00:40    [junit4] ERROR   0.02s J3 | STCClusteringAlgorithmTest.testCarrot1008 <<<
20-Sep-2019 11:00:40    [junit4]    > Throwable #1: java.lang.UnsupportedClassVersionError: org/simpleframework/xml/core/Persister : Unsupported major.minor version 52.0
20-Sep-2019 11:00:40    [junit4]    >         at __randomizedtesting.SeedInfo.seed([D0B241FC88C4131E:C63AC35F8DE11374]:0)
20-Sep-2019 11:00:40    [junit4]    >         at java.lang.ClassLoader.defineClass1(Native Method)
20-Sep-2019 11:00:40    [junit4]    >         at java.lang.ClassLoader.defineClass(ClassLoader.java:800)
20-Sep-2019 11:00:40    [junit4]    >         at java.security.SecureClassLoader.defineClass(SecureClassLoader.java:142)
20-Sep-2019 11:00:40    [junit4]    >         at java.net.URLClassLoader.defineClass(URLClassLoader.java:449)
20-Sep-2019 11:00:40    [junit4]    >         at java.net.URLClassLoader.access$100(URLClassLoader.java:71)
20-Sep-2019 11:00:40    [junit4]    >         at java.net.URLClassLoader$1.run(URLClassLoader.java:361)
20-Sep-2019 11:00:40    [junit4]    >         at java.net.URLClassLoader$1.run(URLClassLoader.java:355)
20-Sep-2019 11:00:40    [junit4]    >         at java.security.AccessController.doPrivileged(Native Method)
20-Sep-2019 11:00:40    [junit4]    >         at java.net.URLClassLoader.findClass(URLClassLoader.java:354)
20-Sep-2019 11:00:40    [junit4]    >         at java.lang.ClassLoader.loadClass(ClassLoader.java:425)
20-Sep-2019 11:00:40    [junit4]    >         at sun.misc.Launcher$AppClassLoader.loadClass(Launcher.java:308)
20-Sep-2019 11:00:40    [junit4]    >         at java.lang.ClassLoader.loadClass(ClassLoader.java:358)
20-Sep-2019 11:00:40    [junit4]    >         at org.carrot2.core.ProcessingResult.deserialize(ProcessingResult.java:372)
20-Sep-2019 11:00:40    [junit4]    >         at org.carrot2.clustering.stc.STCClusteringAlgorithmTest.testCarrot1008(STCClusteringAlgorithmTest.java:117)
20-Sep-2019 11:00:40    [junit4]    >         at sun.reflect.NativeMethodAccessorImpl.invoke0(Native Method)
20-Sep-2019 11:00:40    [junit4]    >         at sun.reflect.NativeMethodAccessorImpl.invoke(NativeMethodAccessorImpl.java:57)
20-Sep-2019 11:00:40    [junit4]    >         at sun.reflect.DelegatingMethodAccessorImpl.invoke(DelegatingMethodAccessorImpl.java:43)
20-Sep-2019 11:00:40    [junit4]    >         at java.lang.reflect.Method.invoke(Method.java:606)
20-Sep-2019 11:00:40    [junit4]    >         at com.carrotsearch.randomizedtesting.RandomizedRunner.invoke(RandomizedRunner.java:1713)
20-Sep-2019 11:00:40    [junit4]    >         at com.carrotsearch.randomizedtesting.RandomizedRunner$8.evaluate(RandomizedRunner.java:907)
20-Sep-2019 11:00:40    [junit4]    >         at com.carrotsearch.randomizedtesting.RandomizedRunner$9.evaluate(RandomizedRunner.java:943)
20-Sep-2019 11:00:40    [junit4]    >         at com.carrotsearch.randomizedtesting.RandomizedRunner$10.evaluate(RandomizedRunner.java:957)
20-Sep-2019 11:00:40    [junit4]    >         at com.carrotsearch.randomizedtesting.rules.SystemPropertiesInvariantRule$1.evaluate(SystemPropertiesInvariantRule.java:59)
20-Sep-2019 11:00:40    [junit4]    >         at com.carrotsearch.randomizedtesting.rules.StatementAdapter.evaluate(StatementAdapter.java:36)
20-Sep-2019 11:00:40    [junit4]    >         at com.carrotsearch.randomizedtesting.ThreadLeakControl$StatementRunner.run(ThreadLeakControl.java:367)
20-Sep-2019 11:00:40    [junit4]    >         at com.carrotsearch.randomizedtesting.ThreadLeakControl.forkTimeoutingTask(ThreadLeakControl.java:811)
20-Sep-2019 11:00:40    [junit4]    >         at com.carrotsearch.randomizedtesting.ThreadLeakControl$3.evaluate(ThreadLeakControl.java:462)
20-Sep-2019 11:00:40    [junit4]    >         at com.carrotsearch.randomizedtesting.RandomizedRunner.runSingleTest(RandomizedRunner.java:916)
20-Sep-2019 11:00:40    [junit4]    >         at com.carrotsearch.randomizedtesting.RandomizedRunner$5.evaluate(RandomizedRunner.java:802)
20-Sep-2019 11:00:40    [junit4]    >         at com.carrotsearch.randomizedtesting.RandomizedRunner$6.evaluate(RandomizedRunner.java:852)
20-Sep-2019 11:00:40    [junit4]    >         at com.carrotsearch.randomizedtesting.RandomizedRunner$7.evaluate(RandomizedRunner.java:863)
20-Sep-2019 11:00:40    [junit4]    >         at com.carrotsearch.randomizedtesting.rules.NoShadowingOrOverridesOnMethodsRule$1.evaluate(NoShadowingOrOverridesOnMethodsRule.java:40)
20-Sep-2019 11:00:40    [junit4]    >         at com.carrotsearch.randomizedtesting.rules.NoShadowingOrOverridesOnMethodsRule$1.evaluate(NoShadowingOrOverridesOnMethodsRule.java:40)
20-Sep-2019 11:00:40    [junit4]    >         at com.carrotsearch.randomizedtesting.rules.SystemPropertiesInvariantRule$1.evaluate(SystemPropertiesInvariantRule.java:59)
20-Sep-2019 11:00:40    [junit4]    >         at com.carrotsearch.randomizedtesting.rules.StatementAdapter.evaluate(StatementAdapter.java:36)
20-Sep-2019 11:00:40    [junit4]    >         at com.carrotsearch.randomizedtesting.ThreadLeakControl$StatementRunner.run(ThreadLeakControl.java:367)
20-Sep-2019 11:00:40    [junit4]    >         at java.lang.Thread.run(Thread.java:745)
20-Sep-2019 11:00:40    [junit4] IGNOR/A 0.00s J3 | STCClusteringAlgorithmTest.testStress
20-Sep-2019 11:00:40    [junit4]    > Assumption #1: 'nightly' test group is disabled (@Nightly(value=))
20-Sep-2019 11:00:40    [junit4] Completed [70/95 (8!)] on J3 in 0.34s, 11 tests, 1 error, 1 skipped <<< FAILURES!
20-Sep-2019 11:00:40    [junit4]
20-Sep-2019 11:00:40    [junit4] Suite: org.carrot2.clustering.synthetic.ByFieldClusteringAlgorithmTest
20-Sep-2019 11:00:40    [junit4] IGNOR/A 0.00s J3 | ByFieldClusteringAlgorithmTest.testStress
20-Sep-2019 11:00:40    [junit4]    > Assumption #1: 'nightly' test group is disabled (@Nightly(value=))
20-Sep-2019 11:00:40    [junit4] Completed [71/95 (8!)] on J3 in 0.03s, 8 tests, 1 skipped
20-Sep-2019 11:00:40    [junit4]
20-Sep-2019 11:00:40    [junit4] Suite: org.carrot2.util.RangeUtilsTest
20-Sep-2019 11:00:40    [junit4] Completed [72/95 (8!)] on J3 in 0.03s, 10 tests
20-Sep-2019 11:00:40    [junit4]
20-Sep-2019 11:00:40    [junit4] Suite: org.carrot2.core.ClusterTest
20-Sep-2019 11:00:40    [junit4] Completed [73/95 (8!)] on J3 in 0.05s, 21 tests
20-Sep-2019 11:00:40    [junit4]
20-Sep-2019 11:00:40    [junit4] Suite: org.carrot2.text.preprocessing.filter.GenitiveLabelFilterTest
20-Sep-2019 11:00:40    [junit4] Completed [74/95 (8!)] on J3 in 0.02s, 5 tests
20-Sep-2019 11:00:40    [junit4]
20-Sep-2019 11:00:40    [junit4] Suite: org.carrot2.text.linguistic.DefaultTokenizerFactoryTest
20-Sep-2019 11:00:40    [junit4] Completed [75/95 (8!)] on J0 in 0.23s, 1 test
20-Sep-2019 11:00:40    [junit4]
20-Sep-2019 11:00:40    [junit4] Suite: org.carrot2.text.preprocessing.DocumentAssignerTest
20-Sep-2019 11:00:40    [junit4] Completed [76/95 (8!)] on J2 in 0.03s, 8 tests
20-Sep-2019 11:00:40    [junit4]
20-Sep-2019 11:00:40    [junit4] Suite: org.carrot2.source.lucene.FSDirectoryWrapperTest
20-Sep-2019 11:00:40    [junit4] ERROR   0.00s J3 | FSDirectoryWrapperTest.testFSDirectorySerialization <<<
20-Sep-2019 11:00:40    [junit4]    > Throwable #1: java.lang.UnsupportedClassVersionError: org/simpleframework/xml/core/Persister : Unsupported major.minor version 52.0
20-Sep-2019 11:00:40    [junit4]    >         at __randomizedtesting.SeedInfo.seed([D0B241FC88C4131E:617A957733528CE6]:0)
20-Sep-2019 11:00:40    [junit4]    >         at java.lang.ClassLoader.defineClass1(Native Method)
20-Sep-2019 11:00:40    [junit4]    >         at java.lang.ClassLoader.defineClass(ClassLoader.java:800)
20-Sep-2019 11:00:40    [junit4]    >         at java.security.SecureClassLoader.defineClass(SecureClassLoader.java:142)
20-Sep-2019 11:00:40    [junit4]    >         at java.net.URLClassLoader.defineClass(URLClassLoader.java:449)
20-Sep-2019 11:00:40    [junit4]    >         at java.net.URLClassLoader.access$100(URLClassLoader.java:71)
20-Sep-2019 11:00:40    [junit4]    >         at java.net.URLClassLoader$1.run(URLClassLoader.java:361)
20-Sep-2019 11:00:40    [junit4]    >         at java.net.URLClassLoader$1.run(URLClassLoader.java:355)
20-Sep-2019 11:00:40    [junit4]    >         at java.security.AccessController.doPrivileged(Native Method)
20-Sep-2019 11:00:40    [junit4]    >         at java.net.URLClassLoader.findClass(URLClassLoader.java:354)
20-Sep-2019 11:00:40    [junit4]    >         at java.lang.ClassLoader.loadClass(ClassLoader.java:425)
20-Sep-2019 11:00:40    [junit4]    >         at sun.misc.Launcher$AppClassLoader.loadClass(Launcher.java:308)
20-Sep-2019 11:00:40    [junit4]    >         at java.lang.ClassLoader.loadClass(ClassLoader.java:358)
20-Sep-2019 11:00:40    [junit4]    >         at org.carrot2.source.lucene.FSDirectoryWrapperTest.testFSDirectorySerialization(FSDirectoryWrapperTest.java:63)
20-Sep-2019 11:00:40    [junit4]    >         at sun.reflect.NativeMethodAccessorImpl.invoke0(Native Method)
20-Sep-2019 11:00:40    [junit4]    >         at sun.reflect.NativeMethodAccessorImpl.invoke(NativeMethodAccessorImpl.java:57)
20-Sep-2019 11:00:40    [junit4]    >         at sun.reflect.DelegatingMethodAccessorImpl.invoke(DelegatingMethodAccessorImpl.java:43)
20-Sep-2019 11:00:40    [junit4]    >         at java.lang.reflect.Method.invoke(Method.java:606)
20-Sep-2019 11:00:40    [junit4]    >         at com.carrotsearch.randomizedtesting.RandomizedRunner.invoke(RandomizedRunner.java:1713)
20-Sep-2019 11:00:40    [junit4]    >         at com.carrotsearch.randomizedtesting.RandomizedRunner$8.evaluate(RandomizedRunner.java:907)
20-Sep-2019 11:00:40    [junit4]    >         at com.carrotsearch.randomizedtesting.rules.SystemPropertiesInvariantRule$1.evaluate(SystemPropertiesInvariantRule.java:59)
20-Sep-2019 11:00:40    [junit4]    >         at com.carrotsearch.randomizedtesting.rules.StatementAdapter.evaluate(StatementAdapter.java:36)
20-Sep-2019 11:00:40    [junit4]    >         at com.carrotsearch.randomizedtesting.ThreadLeakControl$StatementRunner.run(ThreadLeakControl.java:367)
20-Sep-2019 11:00:40    [junit4]    >         at com.carrotsearch.randomizedtesting.ThreadLeakControl.forkTimeoutingTask(ThreadLeakControl.java:811)
20-Sep-2019 11:00:40    [junit4]    >         at com.carrotsearch.randomizedtesting.ThreadLeakControl$3.evaluate(ThreadLeakControl.java:462)
20-Sep-2019 11:00:40    [junit4]    >         at com.carrotsearch.randomizedtesting.RandomizedRunner.runSingleTest(RandomizedRunner.java:916)
20-Sep-2019 11:00:40    [junit4]    >         at com.carrotsearch.randomizedtesting.RandomizedRunner$5.evaluate(RandomizedRunner.java:802)
20-Sep-2019 11:00:40    [junit4]    >         at com.carrotsearch.randomizedtesting.RandomizedRunner$6.evaluate(RandomizedRunner.java:852)
20-Sep-2019 11:00:40    [junit4]    >         at com.carrotsearch.randomizedtesting.RandomizedRunner$7.evaluate(RandomizedRunner.java:863)
20-Sep-2019 11:00:40    [junit4]    >         at com.carrotsearch.randomizedtesting.rules.NoShadowingOrOverridesOnMethodsRule$1.evaluate(NoShadowingOrOverridesOnMethodsRule.java:40)
20-Sep-2019 11:00:40    [junit4]    >         at com.carrotsearch.randomizedtesting.rules.NoShadowingOrOverridesOnMethodsRule$1.evaluate(NoShadowingOrOverridesOnMethodsRule.java:40)
20-Sep-2019 11:00:40    [junit4]    >         at com.carrotsearch.randomizedtesting.rules.SystemPropertiesInvariantRule$1.evaluate(SystemPropertiesInvariantRule.java:59)
20-Sep-2019 11:00:40    [junit4]    >         at com.carrotsearch.randomizedtesting.rules.StatementAdapter.evaluate(StatementAdapter.java:36)
20-Sep-2019 11:00:40    [junit4]    >         at com.carrotsearch.randomizedtesting.ThreadLeakControl$StatementRunner.run(ThreadLeakControl.java:367)
20-Sep-2019 11:00:40    [junit4]    >         at java.lang.Thread.run(Thread.java:745)
20-Sep-2019 11:00:40    [junit4] Completed [77/95 (9!)] on J3 in 0.23s, 1 test, 1 error <<< FAILURES!
20-Sep-2019 11:00:40    [junit4]
20-Sep-2019 11:00:40    [junit4] Suite: org.carrot2.clustering.kmeans.BisectingKMeansClusteringAlgorithmTest
20-Sep-2019 11:00:40    [junit4] IGNOR/A 0.00s J1 | BisectingKMeansClusteringAlgorithmTest.testStress
20-Sep-2019 11:00:40    [junit4]    > Assumption #1: 'nightly' test group is disabled (@Nightly(value=))
20-Sep-2019 11:00:40    [junit4] Completed [78/95 (9!)] on J1 in 0.89s, 8 tests, 1 skipped
20-Sep-2019 11:00:40    [junit4]
20-Sep-2019 11:00:40    [junit4] Suite: org.carrot2.clustering.lingo.ClusterLabelBuilderTest
20-Sep-2019 11:00:40    [junit4] Completed [79/95 (9!)] on J0 in 0.06s, 6 tests
20-Sep-2019 11:00:40    [junit4]
20-Sep-2019 11:00:40    [junit4] Suite: org.carrot2.text.linguistic.DefaultStemmerFactoryTest
20-Sep-2019 11:00:40    [junit4] Completed [80/95 (9!)] on J2 in 0.03s, 2 tests
20-Sep-2019 11:00:40    [junit4]
20-Sep-2019 11:00:40    [junit4] Suite: org.carrot2.output.metrics.PrecisionRecallMetricTest
20-Sep-2019 11:00:40    [junit4] Completed [81/95 (9!)] on J3 in 0.02s, 11 tests
20-Sep-2019 11:00:40    [junit4]
20-Sep-2019 11:00:40    [junit4] Suite: org.carrot2.matrix.factorization.MatrixFactorizationTest
20-Sep-2019 11:00:40    [junit4] Completed [82/95 (9!)] on J1 in 0.02s, 6 tests
20-Sep-2019 11:00:40    [junit4]
20-Sep-2019 11:00:40    [junit4] Suite: org.carrot2.clustering.lingo.ClusterDocumentAssignerTest
20-Sep-2019 11:00:40    [junit4] Completed [83/95 (9!)] on J0 in 0.02s, 4 tests
20-Sep-2019 11:00:40    [junit4]
20-Sep-2019 11:00:40    [junit4] Suite: org.carrot2.util.resource.ServletContextLocatorTest
20-Sep-2019 11:00:40    [junit4] Completed [84/95 (9!)] on J2 in 0.00s, 1 test
20-Sep-2019 11:00:40    [junit4]
20-Sep-2019 11:00:40    [junit4] Suite: org.carrot2.text.preprocessing.WordMarkerTest
20-Sep-2019 11:00:40    [junit4] Completed [85/95 (9!)] on J3 in 0.02s, 2 tests
20-Sep-2019 11:00:40    [junit4]
20-Sep-2019 11:00:40    [junit4] Suite: org.carrot2.text.preprocessing.SubstringComparatorTest
20-Sep-2019 11:00:40    [junit4] Completed [86/95 (9!)] on J1 in 0.02s, 2 tests
20-Sep-2019 11:00:40    [junit4]
20-Sep-2019 11:00:40    [junit4] Suite: org.carrot2.webapp.filter.QueryWordHighlighterTest
20-Sep-2019 11:00:40    [junit4] Completed [87/95 (9!)] on J0 in 0.02s, 14 tests
20-Sep-2019 11:00:40    [junit4]
20-Sep-2019 11:00:40    [junit4] Suite: org.carrot2.util.IntArrayPredicateIteratorTest
20-Sep-2019 11:00:40    [junit4] Completed [88/95 (9!)] on J2 in 0.00s, 5 tests
20-Sep-2019 11:00:40    [junit4]
20-Sep-2019 11:00:41    [junit4] Suite: org.carrot2.text.linguistic.EnglishTest
20-Sep-2019 11:00:41    [junit4] Completed [89/95 (9!)] on J3 in 0.00s, 5 tests
20-Sep-2019 11:00:41    [junit4]
20-Sep-2019 11:00:41    [junit4] Suite: org.carrot2.util.StringUtilsTest
20-Sep-2019 11:00:41    [junit4] Completed [90/95 (9!)] on J1 in 0.02s, 9 tests
20-Sep-2019 11:00:41    [junit4]
20-Sep-2019 11:00:41    [junit4] Suite: org.carrot2.source.microsoft.v7.Bing7ResponseParsingTest
20-Sep-2019 11:00:41    [junit4] IGNOR/A 0.00s J0 | Bing7ResponseParsingTest.testValidSearchResponse
20-Sep-2019 11:00:41    [junit4]    > Assumption #1: got: <false>, expected: is <true>
20-Sep-2019 11:00:41    [junit4] IGNOR/A 0.00s J0 | Bing7ResponseParsingTest.testInvalidKey
20-Sep-2019 11:00:41    [junit4]    > Assumption #1: got: <false>, expected: is <true>
20-Sep-2019 11:00:41    [junit4] IGNOR/A 0.00s J0 | Bing7ResponseParsingTest.testError
20-Sep-2019 11:00:41    [junit4]    > Assumption #1: got: <false>, expected: is <true>
20-Sep-2019 11:00:41    [junit4] Completed [91/95 (9!)] on J0 in 0.00s, 3 tests, 3 skipped
20-Sep-2019 11:00:41    [junit4]
20-Sep-2019 11:00:41    [junit4] Suite: org.carrot2.source.pubmed.PubMedIdSearchHandlerTest
20-Sep-2019 11:00:41    [junit4] Completed [92/95 (9!)] on J2 in 0.02s, 1 test
20-Sep-2019 11:00:41    [junit4]
20-Sep-2019 11:00:41    [junit4] Suite: org.carrot2.text.linguistic.HindiStemmerFactoryTest
20-Sep-2019 11:00:41    [junit4] Completed [93/95 (9!)] on J3 in 0.00s, 1 test
20-Sep-2019 11:00:41    [junit4]
20-Sep-2019 11:00:41    [junit4] Suite: org.carrot2.util.attribute.ResourceFromStringTest
20-Sep-2019 11:00:41    [junit4] Completed [94/95 (9!)] on J1 in 0.02s, 2 tests
20-Sep-2019 11:00:41    [junit4]
20-Sep-2019 11:00:41    [junit4] Suite: org.carrot2.webapp.ControlUnicodeCharacterTest
20-Sep-2019 11:00:41    [junit4] ERROR   0.00s J0 | ControlUnicodeCharacterTest.testSimpleXmlHandling <<<
20-Sep-2019 11:00:41    [junit4]    > Throwable #1: java.lang.UnsupportedClassVersionError: org/simpleframework/xml/core/Persister : Unsupported major.minor version 52.0
20-Sep-2019 11:00:41    [junit4]    >         at __randomizedtesting.SeedInfo.seed([D0B241FC88C4131E:2F891C1FA5BF5C90]:0)
20-Sep-2019 11:00:41    [junit4]    >         at java.lang.ClassLoader.defineClass1(Native Method)
20-Sep-2019 11:00:41    [junit4]    >         at java.lang.ClassLoader.defineClass(ClassLoader.java:800)
20-Sep-2019 11:00:41    [junit4]    >         at java.security.SecureClassLoader.defineClass(SecureClassLoader.java:142)
20-Sep-2019 11:00:41    [junit4]    >         at java.net.URLClassLoader.defineClass(URLClassLoader.java:449)
20-Sep-2019 11:00:41    [junit4]    >         at java.net.URLClassLoader.access$100(URLClassLoader.java:71)
20-Sep-2019 11:00:41    [junit4]    >         at java.net.URLClassLoader$1.run(URLClassLoader.java:361)
20-Sep-2019 11:00:41    [junit4]    >         at java.net.URLClassLoader$1.run(URLClassLoader.java:355)
20-Sep-2019 11:00:41    [junit4]    >         at java.security.AccessController.doPrivileged(Native Method)
20-Sep-2019 11:00:41    [junit4]    >         at java.net.URLClassLoader.findClass(URLClassLoader.java:354)
20-Sep-2019 11:00:41    [junit4]    >         at java.lang.ClassLoader.loadClass(ClassLoader.java:425)
20-Sep-2019 11:00:41    [junit4]    >         at sun.misc.Launcher$AppClassLoader.loadClass(Launcher.java:308)
20-Sep-2019 11:00:41    [junit4]    >         at java.lang.ClassLoader.loadClass(ClassLoader.java:358)
20-Sep-2019 11:00:41    [junit4]    >         at org.carrot2.webapp.ControlUnicodeCharacterTest.testSimpleXmlHandling(ControlUnicodeCharacterTest.java:70)
20-Sep-2019 11:00:41    [junit4]    >         at sun.reflect.NativeMethodAccessorImpl.invoke0(Native Method)
20-Sep-2019 11:00:41    [junit4]    >         at sun.reflect.NativeMethodAccessorImpl.invoke(NativeMethodAccessorImpl.java:57)
20-Sep-2019 11:00:41    [junit4]    >         at sun.reflect.DelegatingMethodAccessorImpl.invoke(DelegatingMethodAccessorImpl.java:43)
20-Sep-2019 11:00:41    [junit4]    >         at java.lang.reflect.Method.invoke(Method.java:606)
20-Sep-2019 11:00:41    [junit4]    >         at com.carrotsearch.randomizedtesting.RandomizedRunner.invoke(RandomizedRunner.java:1713)
20-Sep-2019 11:00:41    [junit4]    >         at com.carrotsearch.randomizedtesting.RandomizedRunner$8.evaluate(RandomizedRunner.java:907)
20-Sep-2019 11:00:41    [junit4]    >         at com.carrotsearch.randomizedtesting.rules.SystemPropertiesInvariantRule$1.evaluate(SystemPropertiesInvariantRule.java:59)
20-Sep-2019 11:00:41    [junit4]    >         at com.carrotsearch.randomizedtesting.rules.StatementAdapter.evaluate(StatementAdapter.java:36)
20-Sep-2019 11:00:41    [junit4]    >         at com.carrotsearch.randomizedtesting.ThreadLeakControl$StatementRunner.run(ThreadLeakControl.java:367)
20-Sep-2019 11:00:41    [junit4]    >         at com.carrotsearch.randomizedtesting.ThreadLeakControl.forkTimeoutingTask(ThreadLeakControl.java:811)
20-Sep-2019 11:00:41    [junit4]    >         at com.carrotsearch.randomizedtesting.ThreadLeakControl$3.evaluate(ThreadLeakControl.java:462)
20-Sep-2019 11:00:41    [junit4]    >         at com.carrotsearch.randomizedtesting.RandomizedRunner.runSingleTest(RandomizedRunner.java:916)
20-Sep-2019 11:00:41    [junit4]    >         at com.carrotsearch.randomizedtesting.RandomizedRunner$5.evaluate(RandomizedRunner.java:802)
20-Sep-2019 11:00:41    [junit4]    >         at com.carrotsearch.randomizedtesting.RandomizedRunner$6.evaluate(RandomizedRunner.java:852)
20-Sep-2019 11:00:41    [junit4]    >         at com.carrotsearch.randomizedtesting.RandomizedRunner$7.evaluate(RandomizedRunner.java:863)
20-Sep-2019 11:00:41    [junit4]    >         at com.carrotsearch.randomizedtesting.rules.NoShadowingOrOverridesOnMethodsRule$1.evaluate(NoShadowingOrOverridesOnMethodsRule.java:40)
20-Sep-2019 11:00:41    [junit4]    >         at com.carrotsearch.randomizedtesting.rules.NoShadowingOrOverridesOnMethodsRule$1.evaluate(NoShadowingOrOverridesOnMethodsRule.java:40)
20-Sep-2019 11:00:41    [junit4]    >         at com.carrotsearch.randomizedtesting.rules.SystemPropertiesInvariantRule$1.evaluate(SystemPropertiesInvariantRule.java:59)
20-Sep-2019 11:00:41    [junit4]    >         at com.carrotsearch.randomizedtesting.rules.StatementAdapter.evaluate(StatementAdapter.java:36)
20-Sep-2019 11:00:41    [junit4]    >         at com.carrotsearch.randomizedtesting.ThreadLeakControl$StatementRunner.run(ThreadLeakControl.java:367)
20-Sep-2019 11:00:41    [junit4]    >         at java.lang.Thread.run(Thread.java:745)
20-Sep-2019 11:00:41    [junit4] Completed [95/95 (10!)] on J0 in 0.02s, 2 tests, 1 error <<< FAILURES!
20-Sep-2019 11:00:41    [junit4]
20-Sep-2019 11:00:41    [junit4]
20-Sep-2019 11:00:41    [junit4] Tests with failures [seed: D0B241FC88C4131E] (first 3 out of 70):
20-Sep-2019 11:00:41    [junit4]   - org.carrot2.util.simplexml.SimpleXmlWrappersTest.testSimpleXmlAnnotatedClass
20-Sep-2019 11:00:41    [junit4]   - org.carrot2.util.simplexml.SimpleXmlWrappersTest.testValueWithDefaultStringType
20-Sep-2019 11:00:41    [junit4]   - org.carrot2.util.simplexml.SimpleXmlWrappersTest.testBoolean
20-Sep-2019 11:00:41    [junit4]
20-Sep-2019 11:00:41    [junit4]
20-Sep-2019 11:00:41    [junit4] JVM J0:     0.37 ..     6.57 =     6.20s
20-Sep-2019 11:00:41    [junit4] JVM J1:     0.37 ..     6.54 =     6.17s
20-Sep-2019 11:00:41    [junit4] JVM J2:     0.37 ..     6.34 =     5.96s
20-Sep-2019 11:00:41    [junit4] JVM J3:     0.37 ..     6.53 =     6.15s
20-Sep-2019 11:00:41    [junit4] Execution time total: 6.59 sec.
20-Sep-2019 11:00:41    [junit4] Tests summary: 95 suites, 884 tests, 70 errors, 77 ignored (73 assumptions)
20-Sep-2019 11:00:41
20-Sep-2019 11:00:41 BUILD FAILED
20-Sep-2019 11:00:41 C:\bamboo\xml-data\build-dir\C2-SOFTWARE-JDK17\build.xml:515: Tests failed. See C:\bamboo\xml-data\build-dir\C2-SOFTWARE-JDK17\tmp\test-report for report.
20-Sep-2019 11:00:41
20-Sep-2019 11:00:41 Total time: 21 seconds
20-Sep-2019 11:00:41 Failing task since return code of [c:\software\java\jdk\ant1.9\bin\ant.bat -Djava.io.tmpdir=C:\Users\bamboo\AppData\Local\Temp\C2-SOFTWARE-JDK17 clean test] was 1 while expected 0
20-Sep-2019 11:00:41 Parsing test results under C:\bamboo\xml-data\build-dir\C2-SOFTWARE-JDK17...
20-Sep-2019 11:00:41 Finished task 'Ant' with result: Failed
20-Sep-2019 11:00:41 Running post build plugin 'Docker Container Cleanup'
20-Sep-2019 11:00:42 Running post build plugin 'NCover Results Collector'
20-Sep-2019 11:00:42 Running post build plugin 'Clover Results Collector'
20-Sep-2019 11:00:42 Running post build plugin 'npm Cache Cleanup'
20-Sep-2019 11:00:42 Running post build plugin 'Artifact Copier'
20-Sep-2019 11:00:42 Finalising the build...
20-Sep-2019 11:00:42 Stopping timer.
20-Sep-2019 11:00:42 Build C2-SOFTWARE-JDK17-298 completed.
20-Sep-2019 11:00:42 Running on server: post build plugin 'NCover Results Collector'
20-Sep-2019 11:00:42 Running on server: post build plugin 'Build Hanging Detection Configuration'
20-Sep-2019 11:00:42 Running on server: post build plugin 'Clover Delta Calculator'
20-Sep-2019 11:00:42 Running on server: post build plugin 'Maven Dependencies Postprocessor'
20-Sep-2019 11:00:42 All post build plugins have finished
20-Sep-2019 11:00:42 Generating build results summary...
20-Sep-2019 11:00:43 Saving build results to disk...
20-Sep-2019 11:00:43 Logging substituted variables...
20-Sep-2019 11:00:43 Indexing build results...
20-Sep-2019 11:00:43 Finished building C2-SOFTWARE-JDK17-298.