Build #248

Build: #248 failed

Job: JDK 1.7 failed

Job result summary

Completed
Duration
46 seconds
Agent
Local Agent 1
Revision
813e4dff3d868eaa151081d0fbf259e0dc864173 813e4dff3d868eaa151081d0fbf259e0dc864173
Total tests
736
Fixed in
#253 (Code changes detected)

Tests

  • 736 tests in total
  • 11 tests failed
  • 11 failures are new
  • 1 minute taken in total.
New test failures 11
Status Test Duration
Collapse Failed ComponentSuitesTest testCarrot2DefaultComponentSuite History
5 secs
java.lang.UnsupportedClassVersionError: org/apache/lucene/index/IndexReader : Unsupported major.minor version 52.0
	at __randomizedtesting.SeedInfo.seed([7F5688B643877B4B:87C3AF6B40946E01]:0)
	at java.lang.ClassLoader.defineClass1(Native Method)
	at java.lang.ClassLoader.defineClass(ClassLoader.java:800)
	at java.security.SecureClassLoader.defineClass(SecureClassLoader.java:142)
	at java.net.URLClassLoader.defineClass(URLClassLoader.java:449)
	at java.net.URLClassLoader.access$100(URLClassLoader.java:71)
	at java.net.URLClassLoader$1.run(URLClassLoader.java:361)
(37 more lines...)
Collapse Failed FSDirectoryWrapperTest initializationError History
< 1 sec
java.lang.UnsupportedClassVersionError: org/apache/lucene/analysis/Analyzer : Unsupported major.minor version 52.0
	at java.lang.ClassLoader.defineClass1(Native Method)
	at java.lang.ClassLoader.defineClass(ClassLoader.java:800)
	at java.security.SecureClassLoader.defineClass(SecureClassLoader.java:142)
	at java.net.URLClassLoader.defineClass(URLClassLoader.java:449)
	at java.net.URLClassLoader.access$100(URLClassLoader.java:71)
	at java.net.URLClassLoader$1.run(URLClassLoader.java:361)
	at java.net.URLClassLoader$1.run(URLClassLoader.java:355)
(27 more lines...)
Collapse Failed LuceneDocumentSourceTest initializationError History
< 1 sec
java.lang.UnsupportedClassVersionError: org/apache/lucene/analysis/Analyzer : Unsupported major.minor version 52.0
	at java.lang.ClassLoader.defineClass1(Native Method)
	at java.lang.ClassLoader.defineClass(ClassLoader.java:800)
	at java.security.SecureClassLoader.defineClass(SecureClassLoader.java:142)
	at java.net.URLClassLoader.defineClass(URLClassLoader.java:449)
	at java.net.URLClassLoader.access$100(URLClassLoader.java:71)
	at java.net.URLClassLoader$1.run(URLClassLoader.java:361)
	at java.net.URLClassLoader$1.run(URLClassLoader.java:355)
(27 more lines...)
Collapse Failed ArabicTest testStemmerAvailable History
< 1 sec
java.lang.AssertionError: [Stemmer class for: Arabic] actual value:<org.carrot2.text.linguistic.IdentityStemmer> should not be equal to:<org.carrot2.text.linguistic.IdentityStemmer>
	at __randomizedtesting.SeedInfo.seed([7F5688B643877B4B:8ED6CAD7DCF8C98E]:0)
	at org.fest.assertions.Fail.failure(Fail.java:228)
	at org.fest.assertions.Fail.fail(Fail.java:218)
	at org.fest.assertions.Fail.failIfEqual(Fail.java:53)
	at org.fest.assertions.GenericAssert.isNotEqualTo(GenericAssert.java:228)
	at org.carrot2.text.linguistic.LanguageModelTestBase.testStemmerAvailable(LanguageModelTestBase.java:56)
	at sun.reflect.NativeMethodAccessorImpl.invoke0(Native Method)
(22 more lines...)
Collapse Failed ArabicTest testStemming History
< 1 sec
java.lang.AssertionError: Stemming difference: ????? should become ??? but was transformed into null expected:<???> but was:<null>
	at __randomizedtesting.SeedInfo.seed([7F5688B643877B4B:6C7C6DE556B17EF0]:0)
	at org.junit.Assert.fail(Assert.java:93)
	at org.junit.Assert.failNotEquals(Assert.java:647)
	at org.junit.Assert.assertEquals(Assert.java:128)
	at org.carrot2.text.linguistic.LanguageModelTestBase.testStemming(LanguageModelTestBase.java:81)
	at sun.reflect.NativeMethodAccessorImpl.invoke0(Native Method)
	at sun.reflect.NativeMethodAccessorImpl.invoke(NativeMethodAccessorImpl.java:57)
(21 more lines...)
Collapse Failed ChineseTokenizerTest testChineseEnglishTermTokens History
< 1 sec
org.junit.ComparisonFailure: expected:<...[0x1] test, [0x1] ??[, [0x1] ??, [0x1] ??, [0x1] e]nglish]> but was:<...[0x1] test, [0x1] ??[????, [0x1] E]nglish]>
	at __randomizedtesting.SeedInfo.seed([7F5688B643877B4B:6EFD0A04FCA04367]:0)
	at sun.reflect.NativeConstructorAccessorImpl.newInstance0(Native Method)
	at sun.reflect.NativeConstructorAccessorImpl.newInstance(NativeConstructorAccessorImpl.java:57)
	at sun.reflect.DelegatingConstructorAccessorImpl.newInstance(DelegatingConstructorAccessorImpl.java:45)
	at java.lang.reflect.Constructor.newInstance(Constructor.java:526)
	at org.fest.assertions.ConstructorInvoker.newInstance(ConstructorInvoker.java:36)
	at org.fest.assertions.ComparisonFailureFactory.newComparisonFailure(ComparisonFailureFactory.java:60)
(29 more lines...)
Collapse Failed ChineseTokenizerTest testJunkTokens History
< 1 sec
org.junit.ComparisonFailure: expected:<[[0x[3] ,]]> but was:<[[0x[103] .]]>
	at __randomizedtesting.SeedInfo.seed([7F5688B643877B4B:3FA4FB90AEDA3388]:0)
	at sun.reflect.NativeConstructorAccessorImpl.newInstance0(Native Method)
	at sun.reflect.NativeConstructorAccessorImpl.newInstance(NativeConstructorAccessorImpl.java:57)
	at sun.reflect.DelegatingConstructorAccessorImpl.newInstance(DelegatingConstructorAccessorImpl.java:45)
	at java.lang.reflect.Constructor.newInstance(Constructor.java:526)
	at org.fest.assertions.ConstructorInvoker.newInstance(ConstructorInvoker.java:36)
	at org.fest.assertions.ComparisonFailureFactory.newComparisonFailure(ComparisonFailureFactory.java:60)
(29 more lines...)
Collapse Failed ChineseTokenizerTest testNumericTokens History
< 1 sec
org.junit.ComparisonFailure: expected:<[[0x1] ??, [0x[2] 11, [0x1] ?, [0x1] ]??]> but was:<[[0x1] ??, [0x[1] ?]??]>
	at __randomizedtesting.SeedInfo.seed([7F5688B643877B4B:22ABE519F78E39EB]:0)
	at sun.reflect.NativeConstructorAccessorImpl.newInstance0(Native Method)
	at sun.reflect.NativeConstructorAccessorImpl.newInstance(NativeConstructorAccessorImpl.java:57)
	at sun.reflect.DelegatingConstructorAccessorImpl.newInstance(DelegatingConstructorAccessorImpl.java:45)
	at java.lang.reflect.Constructor.newInstance(Constructor.java:526)
	at org.fest.assertions.ConstructorInvoker.newInstance(ConstructorInvoker.java:36)
	at org.fest.assertions.ComparisonFailureFactory.newComparisonFailure(ComparisonFailureFactory.java:60)
(29 more lines...)
Collapse Failed ChineseTokenizerTest testPunctuationTokens History
< 1 sec
org.junit.ComparisonFailure: expected:<[[0x1] ??[, [0x1] ??, [0x1] ??, [0x3] ,, [0x1] ?, [0x1] ?, [0x1] ?, [0x1] ??, [0x3] ,, [0x1] ?, [0x1] ??, [0x1] ?, [0x3] ,]]> but was:<[[0x1] ??[????, [0x1] ?????, [0x1] ????]]>
	at __randomizedtesting.SeedInfo.seed([7F5688B643877B4B:B7C18ACB7B3F03D]:0)
	at sun.reflect.NativeConstructorAccessorImpl.newInstance0(Native Method)
	at sun.reflect.NativeConstructorAccessorImpl.newInstance(NativeConstructorAccessorImpl.java:57)
	at sun.reflect.DelegatingConstructorAccessorImpl.newInstance(DelegatingConstructorAccessorImpl.java:45)
	at java.lang.reflect.Constructor.newInstance(Constructor.java:526)
	at org.fest.assertions.ConstructorInvoker.newInstance(ConstructorInvoker.java:36)
	at org.fest.assertions.ComparisonFailureFactory.newComparisonFailure(ComparisonFailureFactory.java:60)
(29 more lines...)
Collapse Failed ChineseTokenizerTest testTermTokens History
< 1 sec
org.junit.ComparisonFailure: expected:<[[0x1] ??[, [0x1] ??, [0x1] ]??]> but was:<[[0x1] ??[??]??]>
	at __randomizedtesting.SeedInfo.seed([7F5688B643877B4B:9FFA419FDFE8D113]:0)
	at sun.reflect.NativeConstructorAccessorImpl.newInstance0(Native Method)
	at sun.reflect.NativeConstructorAccessorImpl.newInstance(NativeConstructorAccessorImpl.java:57)
	at sun.reflect.DelegatingConstructorAccessorImpl.newInstance(DelegatingConstructorAccessorImpl.java:45)
	at java.lang.reflect.Constructor.newInstance(Constructor.java:526)
	at org.fest.assertions.ConstructorInvoker.newInstance(ConstructorInvoker.java:36)
	at org.fest.assertions.ComparisonFailureFactory.newComparisonFailure(ComparisonFailureFactory.java:60)
(29 more lines...)
Collapse Failed DefaultTokenizerFactoryTest testChineseHasSmartChineseTokenizer History
< 1 sec
java.lang.AssertionError: org.carrot2.text.analysis.ExtendedWhitespaceTokenizer
	at __randomizedtesting.SeedInfo.seed([7F5688B643877B4B:F7B870CA134E87F4]:0)
	at org.junit.Assert.fail(Assert.java:93)
	at org.junit.Assert.assertTrue(Assert.java:43)
	at org.carrot2.text.linguistic.DefaultTokenizerFactoryTest.testChineseHasSmartChineseTokenizer(DefaultTokenizerFactoryTest.java:43)
	at sun.reflect.NativeMethodAccessorImpl.invoke0(Native Method)
	at sun.reflect.NativeMethodAccessorImpl.invoke(NativeMethodAccessorImpl.java:57)
	at sun.reflect.DelegatingMethodAccessorImpl.invoke(DelegatingMethodAccessorImpl.java:43)
(20 more lines...)

Error summary

The build generated some errors. See the full build log for more details.


BUILD FAILED
/mnt/work/bamboo-home/xml-data/build-dir/C2-SOFTWARE-JDK17/build.xml:516: Tests failed. See /mnt/work/bamboo-home/xml-data/build-dir/C2-SOFTWARE-JDK17/tmp/test-report for report.

Total time: 46 seconds