Build #139

Build: #139 failed

Job: JDK 1.7 failed

Stages & jobs

  1. Compile and test

  2. Package

  3. Upload

Job result summary

Completed
Duration
18 seconds
Revision
4d746650a6b4ce43ac4eb2bab053eda58ecdaba1 4d746650a6b4ce43ac4eb2bab053eda58ecdaba1
Total tests
664
Fixed in
#140 (Code changes detected)

Tests

  • 664 tests in total
  • 1 test failed
  • 1 failure is new
  • 17 seconds taken in total.
New test failures 1
Status Test Duration
Collapse Failed XmlDocumentSourceTest testGappedIdsInSourceXml History
< 1 sec
java.lang.AssertionError: <'java.lang.IllegalArgumentException: Null identifiers cannot be mixed with existing non-null identifiers:  [existing: [null, 2, 5]]'> should contain the String:<'Identifiers must be unique'>
	at __randomizedtesting.SeedInfo.seed([5F2B9B7CE24A3227:118E1761990A8492]:0)
	at org.fest.assertions.Fail.failure(Fail.java:228)
	at org.fest.assertions.Assert.failure(Assert.java:149)
	at org.fest.assertions.StringAssert.contains(StringAssert.java:73)
	at org.carrot2.source.xml.XmlDocumentSourceTest.testGappedIdsInSourceXml(XmlDocumentSourceTest.java:166)
	at sun.reflect.NativeMethodAccessorImpl.invoke0(Native Method)
	at sun.reflect.NativeMethodAccessorImpl.invoke(NativeMethodAccessorImpl.java:57)
(22 more lines...)

Error summary

The build generated some errors. See the full build log for more details.


BUILD FAILED
/mnt/work/bamboo-home/xml-data/build-dir/C2-SOFTWARE-JDK17/build.xml:518: Tests failed. See /mnt/work/bamboo-home/xml-data/build-dir/C2-SOFTWARE-JDK17/tmp/test-report for report.

Total time: 17 seconds