Build #272

Build: #272 failed Changes by Dawid Weiss

Stages & jobs

  1. Compile and test

  2. Package

  3. Upload

Logs

The following logs have been generated by the jobs in this plan.
  • Expand all
  • Collapse all
Job Logs
Collapse Maven Package Download or View
11-May-2018 10:02:01      [exec] [WARNING] The POM for org.carrot2.attributes:attributes-binder:jar:1.3.3 is missing, no dependency information available
11-May-2018 10:02:01      [exec] [INFO] ------------------------------------------------------------------------
11-May-2018 10:02:01      [exec] [INFO] Reactor Summary:
11-May-2018 10:02:01      [exec] [INFO]
11-May-2018 10:02:01      [exec] [INFO] Carrot2 3.16.0-SNAPSHOT ............................ FAILURE [  0.106 s]
11-May-2018 10:02:01      [exec] [INFO] Carrot2 Core (algorithms and data sources) ......... SKIPPED
11-May-2018 10:02:01      [exec] [INFO] Carrot2 Core Mini (algorithms and selected sources) 3.16.0-SNAPSHOT SKIPPED
11-May-2018 10:02:01      [exec] [INFO] ------------------------------------------------------------------------
11-May-2018 10:02:01      [exec] [INFO] BUILD FAILURE
11-May-2018 10:02:01      [exec] [INFO] ------------------------------------------------------------------------
11-May-2018 10:02:01      [exec] [INFO] Total time: 0.200 s
11-May-2018 10:02:01      [exec] [INFO] Finished at: 2018-05-11T10:02:01+02:00
11-May-2018 10:02:01      [exec] [INFO] ------------------------------------------------------------------------
11-May-2018 10:02:01      [exec] [ERROR] Failed to execute goal on project carrot2: Could not resolve dependencies for project org.carrot2:carrot2:pom:3.16.0-SNAPSHOT: Failure to find org.carrot2.attributes:attributes-binder:jar:1.3.3 in https://oss.sonatype.org/content/repositories/releases was cached in the local repository, resolution will not be reattempted until the update interval of sonatype.releases has elapsed or updates are forced -> [Help 1]
11-May-2018 10:02:01      [exec] [ERROR]
11-May-2018 10:02:01      [exec] [ERROR] To see the full stack trace of the errors, re-run Maven with the -e switch.
11-May-2018 10:02:01      [exec] [ERROR] Re-run Maven using the -X switch to enable full debug logging.
11-May-2018 10:02:01      [exec] [ERROR]
11-May-2018 10:02:01      [exec] [ERROR] For more information about the errors and possible solutions, please read the following articles:
11-May-2018 10:02:01      [exec] [ERROR] [Help 1] http://cwiki.apache.org/confluence/display/MAVEN/DependencyResolutionException
11-May-2018 10:02:01
11-May-2018 10:02:01 BUILD FAILED
11-May-2018 10:02:01 /home/bamboo/xml-data/build-dir/C2-SOFTWARE-MAVEN/etc/maven/build.xml:33: exec returned: 1
11-May-2018 10:02:01
11-May-2018 10:02:01 Total time: 25 seconds