Build #248

Build: #248 failed Changes by Dawid Weiss

Build result summary

Details

Completed
Duration
52 seconds
Labels
None
Revision
813e4dff3d868eaa151081d0fbf259e0dc864173 813e4dff3d868eaa151081d0fbf259e0dc864173
Total tests
2242
Failing since
#247 (Manual run by Dawid Weiss)
Fixed in
#249 (Manual run by Dawid Weiss)

Tests

Responsible

This build has been failing since #247
No one has taken responsibility

Code commits

Author Commit Message Commit date
Dawid Weiss Dawid Weiss 813e4dff3d868eaa151081d0fbf259e0dc864173 813e4dff3d868eaa151081d0fbf259e0dc864173 CARROT-1171: Upgrade Lucene to version 6.6.0

Configuration changes

Plan configuration has changed since the last successful build. See the plan audit log for more details.

Tests

New test failures 11
Status Test View job Duration
Collapse Failed ComponentSuitesTest testCarrot2DefaultComponentSuite History
JDK 1.7 5 secs
java.lang.UnsupportedClassVersionError: org/apache/lucene/index/IndexReader : Unsupported major.minor version 52.0
	at __randomizedtesting.SeedInfo.seed([7F5688B643877B4B:87C3AF6B40946E01]:0)
	at java.lang.ClassLoader.defineClass1(Native Method)
	at java.lang.ClassLoader.defineClass(ClassLoader.java:800)
	at java.security.SecureClassLoader.defineClass(SecureClassLoader.java:142)
	at java.net.URLClassLoader.defineClass(URLClassLoader.java:449)
	at java.net.URLClassLoader.access$100(URLClassLoader.java:71)
	at java.net.URLClassLoader$1.run(URLClassLoader.java:361)
(37 more lines...)
Collapse Failed FSDirectoryWrapperTest initializationError History
JDK 1.7 < 1 sec
java.lang.UnsupportedClassVersionError: org/apache/lucene/analysis/Analyzer : Unsupported major.minor version 52.0
	at java.lang.ClassLoader.defineClass1(Native Method)
	at java.lang.ClassLoader.defineClass(ClassLoader.java:800)
	at java.security.SecureClassLoader.defineClass(SecureClassLoader.java:142)
	at java.net.URLClassLoader.defineClass(URLClassLoader.java:449)
	at java.net.URLClassLoader.access$100(URLClassLoader.java:71)
	at java.net.URLClassLoader$1.run(URLClassLoader.java:361)
	at java.net.URLClassLoader$1.run(URLClassLoader.java:355)
(27 more lines...)
Collapse Failed LuceneDocumentSourceTest initializationError History
JDK 1.7 < 1 sec
java.lang.UnsupportedClassVersionError: org/apache/lucene/analysis/Analyzer : Unsupported major.minor version 52.0
	at java.lang.ClassLoader.defineClass1(Native Method)
	at java.lang.ClassLoader.defineClass(ClassLoader.java:800)
	at java.security.SecureClassLoader.defineClass(SecureClassLoader.java:142)
	at java.net.URLClassLoader.defineClass(URLClassLoader.java:449)
	at java.net.URLClassLoader.access$100(URLClassLoader.java:71)
	at java.net.URLClassLoader$1.run(URLClassLoader.java:361)
	at java.net.URLClassLoader$1.run(URLClassLoader.java:355)
(27 more lines...)
Collapse Failed ArabicTest testStemmerAvailable History
JDK 1.7 < 1 sec
java.lang.AssertionError: [Stemmer class for: Arabic] actual value:<org.carrot2.text.linguistic.IdentityStemmer> should not be equal to:<org.carrot2.text.linguistic.IdentityStemmer>
	at __randomizedtesting.SeedInfo.seed([7F5688B643877B4B:8ED6CAD7DCF8C98E]:0)
	at org.fest.assertions.Fail.failure(Fail.java:228)
	at org.fest.assertions.Fail.fail(Fail.java:218)
	at org.fest.assertions.Fail.failIfEqual(Fail.java:53)
	at org.fest.assertions.GenericAssert.isNotEqualTo(GenericAssert.java:228)
	at org.carrot2.text.linguistic.LanguageModelTestBase.testStemmerAvailable(LanguageModelTestBase.java:56)
	at sun.reflect.NativeMethodAccessorImpl.invoke0(Native Method)
(22 more lines...)
Collapse Failed ArabicTest testStemming History
JDK 1.7 < 1 sec
java.lang.AssertionError: Stemming difference: ????? should become ??? but was transformed into null expected:<???> but was:<null>
	at __randomizedtesting.SeedInfo.seed([7F5688B643877B4B:6C7C6DE556B17EF0]:0)
	at org.junit.Assert.fail(Assert.java:93)
	at org.junit.Assert.failNotEquals(Assert.java:647)
	at org.junit.Assert.assertEquals(Assert.java:128)
	at org.carrot2.text.linguistic.LanguageModelTestBase.testStemming(LanguageModelTestBase.java:81)
	at sun.reflect.NativeMethodAccessorImpl.invoke0(Native Method)
	at sun.reflect.NativeMethodAccessorImpl.invoke(NativeMethodAccessorImpl.java:57)
(21 more lines...)
Collapse Failed ChineseTokenizerTest testPunctuationTokens History
JDK 1.7 < 1 sec
org.junit.ComparisonFailure: expected:<[[0x1] ??[, [0x1] ??, [0x1] ??, [0x3] ,, [0x1] ?, [0x1] ?, [0x1] ?, [0x1] ??, [0x3] ,, [0x1] ?, [0x1] ??, [0x1] ?, [0x3] ,]]> but was:<[[0x1] ??[????, [0x1] ?????, [0x1] ????]]>
	at __randomizedtesting.SeedInfo.seed([7F5688B643877B4B:B7C18ACB7B3F03D]:0)
	at sun.reflect.NativeConstructorAccessorImpl.newInstance0(Native Method)
	at sun.reflect.NativeConstructorAccessorImpl.newInstance(NativeConstructorAccessorImpl.java:57)
	at sun.reflect.DelegatingConstructorAccessorImpl.newInstance(DelegatingConstructorAccessorImpl.java:45)
	at java.lang.reflect.Constructor.newInstance(Constructor.java:526)
	at org.fest.assertions.ConstructorInvoker.newInstance(ConstructorInvoker.java:36)
	at org.fest.assertions.ComparisonFailureFactory.newComparisonFailure(ComparisonFailureFactory.java:60)
(29 more lines...)
Collapse Failed ChineseTokenizerTest testChineseEnglishTermTokens History
JDK 1.7 < 1 sec
org.junit.ComparisonFailure: expected:<...[0x1] test, [0x1] ??[, [0x1] ??, [0x1] ??, [0x1] e]nglish]> but was:<...[0x1] test, [0x1] ??[????, [0x1] E]nglish]>
	at __randomizedtesting.SeedInfo.seed([7F5688B643877B4B:6EFD0A04FCA04367]:0)
	at sun.reflect.NativeConstructorAccessorImpl.newInstance0(Native Method)
	at sun.reflect.NativeConstructorAccessorImpl.newInstance(NativeConstructorAccessorImpl.java:57)
	at sun.reflect.DelegatingConstructorAccessorImpl.newInstance(DelegatingConstructorAccessorImpl.java:45)
	at java.lang.reflect.Constructor.newInstance(Constructor.java:526)
	at org.fest.assertions.ConstructorInvoker.newInstance(ConstructorInvoker.java:36)
	at org.fest.assertions.ComparisonFailureFactory.newComparisonFailure(ComparisonFailureFactory.java:60)
(29 more lines...)
Collapse Failed ChineseTokenizerTest testJunkTokens History
JDK 1.7 < 1 sec
org.junit.ComparisonFailure: expected:<[[0x[3] ,]]> but was:<[[0x[103] .]]>
	at __randomizedtesting.SeedInfo.seed([7F5688B643877B4B:3FA4FB90AEDA3388]:0)
	at sun.reflect.NativeConstructorAccessorImpl.newInstance0(Native Method)
	at sun.reflect.NativeConstructorAccessorImpl.newInstance(NativeConstructorAccessorImpl.java:57)
	at sun.reflect.DelegatingConstructorAccessorImpl.newInstance(DelegatingConstructorAccessorImpl.java:45)
	at java.lang.reflect.Constructor.newInstance(Constructor.java:526)
	at org.fest.assertions.ConstructorInvoker.newInstance(ConstructorInvoker.java:36)
	at org.fest.assertions.ComparisonFailureFactory.newComparisonFailure(ComparisonFailureFactory.java:60)
(29 more lines...)
Collapse Failed ChineseTokenizerTest testNumericTokens History
JDK 1.7 < 1 sec
org.junit.ComparisonFailure: expected:<[[0x1] ??, [0x[2] 11, [0x1] ?, [0x1] ]??]> but was:<[[0x1] ??, [0x[1] ?]??]>
	at __randomizedtesting.SeedInfo.seed([7F5688B643877B4B:22ABE519F78E39EB]:0)
	at sun.reflect.NativeConstructorAccessorImpl.newInstance0(Native Method)
	at sun.reflect.NativeConstructorAccessorImpl.newInstance(NativeConstructorAccessorImpl.java:57)
	at sun.reflect.DelegatingConstructorAccessorImpl.newInstance(DelegatingConstructorAccessorImpl.java:45)
	at java.lang.reflect.Constructor.newInstance(Constructor.java:526)
	at org.fest.assertions.ConstructorInvoker.newInstance(ConstructorInvoker.java:36)
	at org.fest.assertions.ComparisonFailureFactory.newComparisonFailure(ComparisonFailureFactory.java:60)
(29 more lines...)
Collapse Failed ChineseTokenizerTest testTermTokens History
JDK 1.7 < 1 sec
org.junit.ComparisonFailure: expected:<[[0x1] ??[, [0x1] ??, [0x1] ]??]> but was:<[[0x1] ??[??]??]>
	at __randomizedtesting.SeedInfo.seed([7F5688B643877B4B:9FFA419FDFE8D113]:0)
	at sun.reflect.NativeConstructorAccessorImpl.newInstance0(Native Method)
	at sun.reflect.NativeConstructorAccessorImpl.newInstance(NativeConstructorAccessorImpl.java:57)
	at sun.reflect.DelegatingConstructorAccessorImpl.newInstance(DelegatingConstructorAccessorImpl.java:45)
	at java.lang.reflect.Constructor.newInstance(Constructor.java:526)
	at org.fest.assertions.ConstructorInvoker.newInstance(ConstructorInvoker.java:36)
	at org.fest.assertions.ComparisonFailureFactory.newComparisonFailure(ComparisonFailureFactory.java:60)
(29 more lines...)
Collapse Failed DefaultTokenizerFactoryTest testChineseHasSmartChineseTokenizer History
JDK 1.7 < 1 sec
java.lang.AssertionError: org.carrot2.text.analysis.ExtendedWhitespaceTokenizer
	at __randomizedtesting.SeedInfo.seed([7F5688B643877B4B:F7B870CA134E87F4]:0)
	at org.junit.Assert.fail(Assert.java:93)
	at org.junit.Assert.assertTrue(Assert.java:43)
	at org.carrot2.text.linguistic.DefaultTokenizerFactoryTest.testChineseHasSmartChineseTokenizer(DefaultTokenizerFactoryTest.java:43)
	at sun.reflect.NativeMethodAccessorImpl.invoke0(Native Method)
	at sun.reflect.NativeMethodAccessorImpl.invoke(NativeMethodAccessorImpl.java:57)
	at sun.reflect.DelegatingMethodAccessorImpl.invoke(DelegatingMethodAccessorImpl.java:43)
(20 more lines...)

Jira issues

IssueDescriptionStatus
Unknown Issue TypeCARROT-1171Could not obtain issue details from Jira