Build #139

Build: #139 failed Changes by Dawid Weiss

Stages & jobs

  1. Compile and test

  2. Package

  3. Upload

Build result summary

Details

Completed
Duration
27 seconds
Labels
None
Revision
4d746650a6b4ce43ac4eb2bab053eda58ecdaba1 4d746650a6b4ce43ac4eb2bab053eda58ecdaba1
Total tests
1328
Fixed in
#140 (Changes by Dawid Weiss)

Tests

Responsible

Code commits

Author Commit Message Commit date
Dawid Weiss Dawid Weiss 4d746650a6b4ce43ac4eb2bab053eda58ecdaba1 4d746650a6b4ce43ac4eb2bab053eda58ecdaba1 LINGO-474: Arabic (RTL) cluster labels are messed up in Workbench
Dawid Weiss Dawid Weiss 44c63315138bbac06e04d893ce2d424048f4571b 44c63315138bbac06e04d893ce2d424048f4571b Better error message on non-unique identifiers.

Tests

New test failures 2
Status Test View job Duration
Collapse Failed XmlDocumentSourceTest testGappedIdsInSourceXml History
JDK 1.7 < 1 sec
java.lang.AssertionError: <'java.lang.IllegalArgumentException: Null identifiers cannot be mixed with existing non-null identifiers:  [existing: [null, 2, 5]]'> should contain the String:<'Identifiers must be unique'>
	at __randomizedtesting.SeedInfo.seed([5F2B9B7CE24A3227:118E1761990A8492]:0)
	at org.fest.assertions.Fail.failure(Fail.java:228)
	at org.fest.assertions.Assert.failure(Assert.java:149)
	at org.fest.assertions.StringAssert.contains(StringAssert.java:73)
	at org.carrot2.source.xml.XmlDocumentSourceTest.testGappedIdsInSourceXml(XmlDocumentSourceTest.java:166)
	at sun.reflect.NativeMethodAccessorImpl.invoke0(Native Method)
	at sun.reflect.NativeMethodAccessorImpl.invoke(NativeMethodAccessorImpl.java:57)
(22 more lines...)
Collapse Failed XmlDocumentSourceTest testGappedIdsInSourceXml History
JDK 1.8 < 1 sec
java.lang.AssertionError: <'java.lang.IllegalArgumentException: Null identifiers cannot be mixed with existing non-null identifiers:  [existing: [null, 2, 5]]'> should contain the String:<'Identifiers must be unique'>
	at __randomizedtesting.SeedInfo.seed([1F4A12C6C33E6987:51EF9EDBB87EDF32]:0)
	at org.fest.assertions.Fail.failure(Fail.java:228)
	at org.fest.assertions.Assert.failure(Assert.java:149)
	at org.fest.assertions.StringAssert.contains(StringAssert.java:73)
	at org.carrot2.source.xml.XmlDocumentSourceTest.testGappedIdsInSourceXml(XmlDocumentSourceTest.java:166)
	at sun.reflect.NativeMethodAccessorImpl.invoke0(Native Method)
	at sun.reflect.NativeMethodAccessorImpl.invoke(NativeMethodAccessorImpl.java:62)
(22 more lines...)

Jira issues

IssueDescriptionStatus
Unknown Issue TypeLINGO-474Could not obtain issue details from Jira