Build #411

Build: #411 failed

Job: JDK 11 (Windows) failed

Stages & jobs

  1. Compile and test

  2. Follow ups

Build log

The build generated 171 lines of output. Download or view full build log

12-Jan-2021 11:48:51 Build Carrot2 - 4.0.x - software - JDK 11 (Windows) #411 (C2-C2S4-C2J11W-411) started building on agent Windows Agent 2
12-Jan-2021 11:48:51 Remote agent on host ZETA
12-Jan-2021 11:48:51 Build working directory is C:\bamboo\xml-data\build-dir\C2-C2S4-C2J11W
12-Jan-2021 11:48:51 Executing build Carrot2 - 4.0.x - software - JDK 11 (Windows) #411 (C2-C2S4-C2J11W-411)
12-Jan-2021 11:48:51 Starting task 'Checkout Default Repository' of type 'com.atlassian.bamboo.plugins.vcs:task.vcs.checkout'
12-Jan-2021 11:48:51 Checking out into C:\bamboo\xml-data\build-dir\C2-C2S4-C2J11W
12-Jan-2021 11:48:51 Updating source code to revision: d1322f580a81e09d4744da1b7482fbe02b36f54e
12-Jan-2021 11:48:52 Fetching 'refs/heads/master' from 'https://github.com/carrot2/carrot2.git'.
12-Jan-2021 11:48:53 From https://github.com/carrot2/carrot2
12-Jan-2021 11:48:53    76604afae..d1322f580  master     -> master
12-Jan-2021 11:48:53 Checking out revision d1322f580a81e09d4744da1b7482fbe02b36f54e.
12-Jan-2021 11:48:54 From file://C:\bamboo\xml-data\build-dir\_git-repositories-cache\aab75aae8437dbcf777127c696a13981dc26f38c
12-Jan-2021 11:48:54    76604afae..d1322f580  master     -> origin/master
12-Jan-2021 11:48:54 Your branch is behind 'origin/master' by 2 commits, and can be fast-forwarded.
12-Jan-2021 11:48:54   (use "git pull" to update your local branch)
12-Jan-2021 11:48:54 Already on 'master'
12-Jan-2021 11:48:54 HEAD is now at d1322f580 Moved some more stuff to opts.
12-Jan-2021 11:48:54 Updated source code to revision: d1322f580a81e09d4744da1b7482fbe02b36f54e
12-Jan-2021 11:48:54 Finished task 'Checkout Default Repository' with result: Success
12-Jan-2021 11:48:54 Running pre-build action: VCS Version Collector
12-Jan-2021 11:48:54
Substituting variable: ${bamboo.capability.system.jdk.JDK 11} with c:\software\java\jdk\jdk11
12-Jan-2021 11:48:54
Substituting variable: ${bamboo.buildNumber} with 411
12-Jan-2021 11:48:54
Substituting variable: ${bamboo.buildKey} with C2-C2S4-C2J11W
12-Jan-2021 11:48:54 Starting task 'gradlew check assemble' of type 'com.atlassian.bamboo.plugins.scripttask:task.builder.script'
12-Jan-2021 11:48:54
Beginning to execute external process for build 'Carrot2 - 4.0.x - software - JDK 11 (Windows) #411 (C2-C2S4-C2J11W-411)'
... running command line:
c:\bamboo\bamboo-home-2\temp\C2-C2S4-C2J11W-411-ScriptBuildTask-7784316824963120716.bat
... in: C:\bamboo\xml-data\build-dir\C2-C2S4-C2J11W
... using extra environment variables:
bamboo_planRepository_1_branch=master
bamboo_capability_system_builder_ant_Ant_1_9=c:\software\java\jdk\ant1.9
bamboo_carrotsearch_secure_staging_user=bamboo
bamboo_planRepository_1_branchDisplayName=master
bamboo_repository_revision_number=d1322f580a81e09d4744da1b7482fbe02b36f54e
bamboo_buildKey=C2-C2S4-C2J11W
bamboo_repository_91226119_git_repositoryUrl=https://github.com/carrot2/carrot2.git
bamboo_shortJobName=JDK 11 (Windows)
bamboo_repository_91226119_revision_number=d1322f580a81e09d4744da1b7482fbe02b36f54e
bamboo_buildResultsUrl=https://builds.carrot2.org/browse/C2-C2S4-C2J11W-411
bamboo_planRepository_repositoryUrl=https://github.com/carrot2/carrot2.git
bamboo_agentId=61898755
bamboo_capability_Remote_agent=
bamboo_carrotsearch_secure_staging_host=kappa.carrotsearch.com
bamboo_capability_system_jdk_JDK_9=c:\software\java\jdk\jdk9
bamboo_planRepository_revision=d1322f580a81e09d4744da1b7482fbe02b36f54e
bamboo_planRepository_previousRevision=76604afaeadc09dbf0085fdc40817fc7aeb22995
bamboo_repository_branch_name=master
bamboo_repository_91226119_git_username=
bamboo_carrotsearch_download_official_port=2233
bamboo_capability_system_jdk_JDK_10=c:\software\java\jdk\jdk10
bamboo_carrot2_website_ssh=carrotse@get.carrotsearch.com:~/sites/project.carrot2.org
bamboo_csssprites_download_path=/srv/vhosts/get.csssprites.org
bamboo_carrotsearch_labs_ssh_port=2233
bamboo_repository_91226119_name=github/carrot2/carrot2/master
bamboo_carrot2_download_user=bamboo
bamboo_capability_tools_dir=c:\bamboo\tools
bamboo_carrotsearch_download_staging_host=kappa.carrotsearch.com
bamboo_carrotsearch_download_official_path=~/sites/get.carrotsearch.com
bamboo_planRepository_branch=master
bamboo_carrotsearch_secure2_ssh=carrotse@get.carrotsearch.com:~/sites/secure.carrotsearch.com
bamboo_capability_system_jdk_JDK_13=c:\software\java\jdk\jdk13
bamboo_capability_system_jdk_JDK_14=c:\software\java\jdk\jdk14
bamboo_capability_system_builder_node_Node_js_12=c:\software
ode
ode.exe
bamboo_capability_system_jdk_JDK_11=c:\software\java\jdk\jdk11
bamboo_planRepository_1_type=gitv2
bamboo_planRepository_branchName=master
bamboo_capability_system_jdk_JDK_12=c:\software\java\jdk\jdk12
bamboo_capability_system_builder_ant_Ant_1_10=c:\software\java\jdk\ant1.10
bamboo_capability_system_jdk_JDK=c:\software\java\jdk\jdk
bamboo_hg_cache_directory=C:\bamboo\xml-data\build-dir\_hg-repositories-cache
bamboo_planRepository_1_username=
bamboo_planRepository_type=gitv2
bamboo_carrot2_download_host=kappa.carrotsearch.com
bamboo_git_cache_directory=C:\bamboo\xml-data\build-dir\_git-repositories-cache
bamboo_carrotsearch_download_staging_user=bamboo
bamboo_capability_system_builder_ant_Ant=c:\software\java\jdk\ant1.9
bamboo_capability_Windows=
bamboo_capability_system_builder_mvn3_Maven_3=c:\software\java\jdk\maven
bamboo_tmp_directory=c:\bamboo\bamboo-home-2\temp
bamboo_planKey=C2-C2S4
bamboo_planRepository_username=
bamboo_carrotsearch_website_ssh=carrotse@get.carrotsearch.com:~/sites/www.carrotsearch.com
bamboo_capability_system_builder_command_yarn=c:\software\yarn\bin\yarn.cmd
bamboo_planRepository_1_branchName=master
bamboo_resultsUrl=https://builds.carrot2.org/browse/C2-C2S4-C2J11W-411
bamboo_carrotsearch_labs_ssh=carrotse@get.carrotsearch.com:~/sites/labs.carrotsearch.com
bamboo_build_working_directory=C:\bamboo\xml-data\build-dir\C2-C2S4-C2J11W
bamboo_planRepository_1_name=github/carrot2/carrot2/master
bamboo_repository_91226119_branch_name=master
bamboo_shortPlanName=4.0.x - software
bamboo_planRepository_name=github/carrot2/carrot2/master
bamboo_buildNumber=411
bamboo_repository_91226119_previous_revision_number=76604afaeadc09dbf0085fdc40817fc7aeb22995
bamboo_npm_authToken=ce5f381d-7f24-4a22-96d8-62af04f484bf
bamboo_carrotsearch_secure_staging_path=/srv/vhosts/staging-secure.carrotsearch.com
bamboo_carrotsearch_secure_ssh_port=2233
bamboo_planName=Carrot2 - 4.0.x - software
bamboo_capability_system_builder_command_git=c:\software\scm\git\bin\git.exe
bamboo_shortPlanKey=C2S4
bamboo_shortJobKey=C2J11W
bamboo_repository_91226119_git_branch=master
bamboo_buildTimeStamp=2021-01-12T11:48:51.987+01:00
bamboo_repository_previous_revision_number=76604afaeadc09dbf0085fdc40817fc7aeb22995
bamboo_repository_git_branch=master
bamboo_buildResultKey=C2-C2S4-C2J11W-411
bamboo_buildPlanName=Carrot2 - 4.0.x - software - JDK 11 (Windows)
bamboo_planRepository_1_revision=d1322f580a81e09d4744da1b7482fbe02b36f54e
bamboo_repository_name=github/carrot2/carrot2/master
bamboo_carrot2_website_ssh_port=2233
bamboo_csssprites_download_host=kappa.carrotsearch.com
bamboo_capability__NET=
bamboo_buildFailed=false
bamboo_agentWorkingDirectory=C:\bamboo\xml-data\build-dir
bamboo_carrotsearch_download_official_host=get.carrotsearch.com
bamboo_capability_system_git_executable=c:\software\scm\git\bin\git.exe
bamboo_l4g_mvn_opts=-Xmx1g
bamboo_repository_git_username=
bamboo_planRepository_1_previousRevision=76604afaeadc09dbf0085fdc40817fc7aeb22995
bamboo_capability_system_jdk_JDK_1_8_IBM=c:\software\java\jdk\jdk1.8-ibm
bamboo_carrotsearch_download_staging_path=/srv/vhosts/staging-get.carrotsearch.com
bamboo_planRepository_branchDisplayName=master
bamboo_csssprites_download_user=bamboo
bamboo_plan_storageTag=plan-84639745
bamboo_carrot2_download_path=/srv/vhosts/get.carrot2.org
bamboo_repository_git_repositoryUrl=https://github.com/carrot2/carrot2.git
bamboo_carrotsearch_download_official_user=carrotse
bamboo_working_directory=C:\bamboo\xml-data\build-dir\C2-C2S4-C2J11W
bamboo_planRepository_1_repositoryUrl=https://github.com/carrot2/carrot2.git
bamboo_capability_system_jdk_JDK_1_8=c:\software\java\jdk\jdk1.8
bamboo_capability_system_builder_command_zip=c:\software\bin\zip.exe
bamboo_capability_system_jdk_JDK_1_6=c:\software\java\jdk\jdk1.6
bamboo_capability_system_jdk_JDK_1_7=c:\software\java\jdk\jdk1.7
bamboo_carrotsearch_secure_ssh=carrotse@get.carrotsearch.com:~/sites/secure.carrotsearch.com
bamboo_carrotsearch_website_ssh_port=2233
12-Jan-2021 11:48:54
12-Jan-2021 11:48:54 C:\bamboo\xml-data\build-dir\C2-C2S4-C2J11W>SET PATH=c:\software\java\jdk\jdk11/bin;$PATH
12-Jan-2021 11:48:54
12-Jan-2021 11:48:54 C:\bamboo\xml-data\build-dir\C2-C2S4-C2J11W>.\gradlew --no-daemon clean check assemble -Dbuild.number=411 -Dbuild.key=C2-C2S4-C2J11W -Dtests.nightly=true
12-Jan-2021 11:48:58 > Task :buildSrc:compileJava UP-TO-DATE
12-Jan-2021 11:49:00
12-Jan-2021 11:49:00 > Task :buildSrc:compileGroovy
12-Jan-2021 11:49:00 WARNING: An illegal reflective access operation has occurred
12-Jan-2021 11:49:00 WARNING: Illegal reflective access by org.codehaus.groovy.reflection.CachedClass (file:/C:/Users/bamboo/.gradle/wrapper/dists/gradle-6.6.1-all/ejrtlte9hlw8v6ii20a9584rs/gradle-6.6.1/lib/groovy-all-1.3-2.5.12.jar) to method java.util.AbstractCollection.hugeCapacity(int)
12-Jan-2021 11:49:00 WARNING: Please consider reporting this to the maintainers of org.codehaus.groovy.reflection.CachedClass
12-Jan-2021 11:49:00 WARNING: Use --illegal-access=warn to enable warnings of further illegal reflective access operations
12-Jan-2021 11:49:00 WARNING: All illegal access operations will be denied in a future release
12-Jan-2021 11:49:00
12-Jan-2021 11:49:00 > Task :buildSrc:pluginDescriptors UP-TO-DATE
12-Jan-2021 11:49:00 > Task :buildSrc:processResources UP-TO-DATE
12-Jan-2021 11:49:00 > Task :buildSrc:classes
12-Jan-2021 11:49:00 > Task :buildSrc:jar
12-Jan-2021 11:49:00 > Task :buildSrc:assemble
12-Jan-2021 11:49:00 > Task :buildSrc:pluginUnderTestMetadata
12-Jan-2021 11:49:00 > Task :buildSrc:compileTestJava NO-SOURCE
12-Jan-2021 11:49:00 > Task :buildSrc:compileTestGroovy NO-SOURCE
12-Jan-2021 11:49:00 > Task :buildSrc:processTestResources NO-SOURCE
12-Jan-2021 11:49:00 > Task :buildSrc:testClasses UP-TO-DATE
12-Jan-2021 11:49:00 > Task :buildSrc:test NO-SOURCE
12-Jan-2021 11:49:00 > Task :buildSrc:validatePlugins
12-Jan-2021 11:49:00 > Task :buildSrc:check
12-Jan-2021 11:49:00 > Task :buildSrc:build
12-Jan-2021 11:49:03
12-Jan-2021 11:49:03 > Configure project :
12-Jan-2021 11:49:03 Spotless is skipping javascript checks (npm not found in path).
12-Jan-2021 11:49:07
12-Jan-2021 11:49:07 > Task :core-examples:clean
12-Jan-2021 11:49:07 > Task :clean
12-Jan-2021 11:49:07 > Task :gradle:clean
12-Jan-2021 11:49:08
12-Jan-2021 11:49:08 > Task :doc:clean
12-Jan-2021 11:49:08 Cleaned .cache/public on :doc, remaining:
12-Jan-2021 11:49:08   .gitignore
12-Jan-2021 11:49:08   .gradle
12-Jan-2021 11:49:08   .htmlvalidate.json
12-Jan-2021 11:49:08   build.gradle
12-Jan-2021 11:49:08   gatsby-browser.js
12-Jan-2021 11:49:08   gatsby-config.js
12-Jan-2021 11:49:08   node_modules
12-Jan-2021 11:49:08   package.json
12-Jan-2021 11:49:08   src
12-Jan-2021 11:49:08   static
12-Jan-2021 11:49:08   yarn.lock
12-Jan-2021 11:49:08
12-Jan-2021 11:49:08 > Task :dcs:examples:clean
12-Jan-2021 11:49:08 > Task :dcs:model:clean
12-Jan-2021 11:49:08 > Task :dcs:tests:clean
12-Jan-2021 11:49:08 > Task :infra:docattrs:clean
12-Jan-2021 11:49:08 > Task :core:clean
12-Jan-2021 11:49:08 > Task :dcs:distribution:clean
12-Jan-2021 11:49:08 > Task :infra:jsondoclet:clean
12-Jan-2021 11:49:08 > Task :infra:jsondoclet-model:clean
12-Jan-2021 11:49:08 > Task :infra:tests:clean
12-Jan-2021 11:49:08 > Task :lang:lucene-chinese:clean
12-Jan-2021 11:49:08 > Task :lang:lucene-japanese:clean
12-Jan-2021 11:49:08 > Task :lang:lucene:clean
12-Jan-2021 11:49:08 > Task :lang:lucene-korean:clean
12-Jan-2021 11:49:08 > Task :lang:polish:clean
12-Jan-2021 11:49:08 > Task :dcs:contexts:javadoc:clean
12-Jan-2021 11:49:08 > Task :dcs:contexts:root:clean
12-Jan-2021 11:49:08 > Task :dcs:contexts:service:clean
12-Jan-2021 11:49:08
12-Jan-2021 11:49:08 > Task :dcs:contexts:frontend:clean
12-Jan-2021 11:49:08 Cleaned C:\bamboo\xml-data\build-dir\C2-C2S4-C2J11W\dcs\contexts\frontend\build, remaining:
12-Jan-2021 11:49:08   .env
12-Jan-2021 11:49:08   .eslintcache
12-Jan-2021 11:49:08   .gitignore
12-Jan-2021 11:49:08   .gradle
12-Jan-2021 11:49:08   .npmrc
12-Jan-2021 11:49:08   .prettierignore
12-Jan-2021 11:49:08   .prettierrc.json
12-Jan-2021 11:49:08   build.gradle
12-Jan-2021 11:49:08   craco.config.js
12-Jan-2021 11:49:08   customizers
12-Jan-2021 11:49:08   node_modules
12-Jan-2021 11:49:08   package.json
12-Jan-2021 11:49:08   public
12-Jan-2021 11:49:08   src
12-Jan-2021 11:49:08   TODO.txt
12-Jan-2021 11:49:08   yarn.lock
12-Jan-2021 11:49:09
12-Jan-2021 11:49:09 > Task :distribution:clean
12-Jan-2021 11:49:10 > Task :infra:tests:compileJava FAILED
12-Jan-2021 11:49:10 > Task :checkUnusedConstraints
12-Jan-2021 11:49:10 > Task :verifyLocks
12-Jan-2021 11:49:10 > Task :core:compileJava FAILED
12-Jan-2021 11:49:10
12-Jan-2021 11:49:10 FAILURE: Build completed with 2 failures.
12-Jan-2021 11:49:10
12-Jan-2021 11:49:10 1: Task failed with an exception.
12-Jan-2021 11:49:10 -----------
12-Jan-2021 11:49:10 * What went wrong:
12-Jan-2021 11:49:10 Execution failed for task ':infra:tests:compileJava'.
12-Jan-2021 11:49:10 > java.lang.IllegalAccessError: class org.gradle.internal.compiler.java.ClassNameCollector (in unnamed module @0x1f420cc9) cannot access class com.sun.tools.javac.code.Symbol$TypeSymbol (in module jdk.compiler) because module jdk.compiler does not export com.sun.tools.javac.code to unnamed module @0x1f420cc9
12-Jan-2021 11:49:10
12-Jan-2021 11:49:10 * Try:
12-Jan-2021 11:49:10 Run with --stacktrace option to get the stack trace. Run with --info or --debug option to get more log output. Run with --scan to get full insights.
12-Jan-2021 11:49:10 ==============================================================================
12-Jan-2021 11:49:10
12-Jan-2021 11:49:10 2: Task failed with an exception.
12-Jan-2021 11:49:10 -----------
12-Jan-2021 11:49:10 * What went wrong:
12-Jan-2021 11:49:10 Execution failed for task ':core:compileJava'.
12-Jan-2021 11:49:10 > java.lang.IllegalAccessError: class org.gradle.internal.compiler.java.ClassNameCollector (in unnamed module @0x1f420cc9) cannot access class com.sun.tools.javac.code.Symbol$TypeSymbol (in module jdk.compiler) because module jdk.compiler does not export com.sun.tools.javac.code to unnamed module @0x1f420cc9
12-Jan-2021 11:49:10
12-Jan-2021 11:49:10 * Try:
12-Jan-2021 11:49:10 Run with --stacktrace option to get the stack trace. Run with --info or --debug option to get more log output. Run with --scan to get full insights.
12-Jan-2021 11:49:10 ==============================================================================
12-Jan-2021 11:49:10
12-Jan-2021 11:49:10 * Get more help at https://help.gradle.org
12-Jan-2021 11:49:10
12-Jan-2021 11:49:10 Deprecated Gradle features were used in this build, making it incompatible with Gradle 7.0.
12-Jan-2021 11:49:10 Use '--warning-mode all' to show the individual deprecation warnings.
12-Jan-2021 11:49:10
12-Jan-2021 11:49:10 BUILD FAILED in 15s
12-Jan-2021 11:49:10 See https://docs.gradle.org/6.6.1/userguide/command_line_interface.html#sec:command_line_warnings
12-Jan-2021 11:49:10 27 actionable tasks: 27 executed
12-Jan-2021 11:49:10 Failing task since return code of [c:\bamboo\bamboo-home-2\temp\C2-C2S4-C2J11W-411-ScriptBuildTask-7784316824963120716.bat] was 1 while expected 0
12-Jan-2021 11:49:10 Finished task 'gradlew check assemble' with result: Failed
12-Jan-2021 11:49:10 Starting task 'JUnit parser' of type 'com.atlassian.bamboo.plugins.testresultparser:task.testresultparser.junit'
12-Jan-2021 11:49:10 Parsing test results under C:\bamboo\xml-data\build-dir\C2-C2S4-C2J11W...
12-Jan-2021 11:49:36 Failing task since test cases were expected but none were found.
12-Jan-2021 11:49:36 Finished task 'JUnit parser' with result: Failed
12-Jan-2021 11:49:36 Running post build plugin 'Docker Container Cleanup'
12-Jan-2021 11:49:36 Running post build plugin 'NCover Results Collector'
12-Jan-2021 11:49:36 Running post build plugin 'Clover Results Collector'
12-Jan-2021 11:49:36 Running post build plugin 'npm Cache Cleanup'
12-Jan-2021 11:49:36 Running post build plugin 'Artifact Copier'
12-Jan-2021 11:49:36 Finalising the build...
12-Jan-2021 11:49:36 Stopping timer.
12-Jan-2021 11:49:36 Build C2-C2S4-C2J11W-411 completed.
12-Jan-2021 11:49:38 Running on server: post build plugin 'NCover Results Collector'
12-Jan-2021 11:49:38 Running on server: post build plugin 'Build Hanging Detection Configuration'
12-Jan-2021 11:49:38 Running on server: post build plugin 'Clover Delta Calculator'
12-Jan-2021 11:49:38 Running on server: post build plugin 'Maven Dependencies Postprocessor'
12-Jan-2021 11:49:38 All post build plugins have finished
12-Jan-2021 11:49:38 Generating build results summary...
12-Jan-2021 11:49:38 Saving build results to disk...
12-Jan-2021 11:49:38 Logging substituted variables...
12-Jan-2021 11:49:38 Indexing build results...
12-Jan-2021 11:49:38 Finished building C2-C2S4-C2J11W-411.