Build: #6 failed Changes by Dawid Weiss

Build result summary

Details

Completed
Duration
24 seconds
Labels
None
Agent
Local Agent 1
Revision
1711ef5941666511dba87f961621e0193cf4f8eb 1711ef5941666511dba87f961621e0193cf4f8eb
Total tests
276
Fixed in
#7 (Changes by Dawid Weiss)

Tests

Responsible

Code commits

Author Commit Message Commit date
Dawid Weiss Dawid Weiss 1711ef5941666511dba87f961621e0193cf4f8eb 1711ef5941666511dba87f961621e0193cf4f8eb Deploy multiple contexts.

Tests

New test failures 1
Status Test View job Duration
Collapse Failed DcsServiceTest listDefaults History
JDK 1.8 < 1 sec
java.io.UncheckedIOException: java.io.UncheckedIOException: java.io.IOException: java.nio.file.NoSuchFileException: /tmp/tests-20190313114145-722/0000 has-space/New Folder (2)/web
java.io.UncheckedIOException: java.io.IOException: java.nio.file.NoSuchFileException: /tmp/tests-20190313114145-722/0000 has-space/New Folder (2)/web
	at __randomizedtesting.SeedInfo.seed([D67F2491024854F6:924D31851EDD8A70]:0)
	at org.carrot2.dcs.it.AbstractDistributionTest.startDcs(AbstractDistributionTest.java:55)
	at org.carrot2.dcs.it.DcsServiceTest.listDefaults(DcsServiceTest.java:13)
	at sun.reflect.NativeMethodAccessorImpl.invoke0(Native Method)
	at sun.reflect.NativeMethodAccessorImpl.invoke(NativeMethodAccessorImpl.java:62)
	at sun.reflect.DelegatingMethodAccessorImpl.invoke(DelegatingMethodAccessorImpl.java:43)
(35 more lines...)