Build: #32 failed

Job: JDK 1.8 failed

Stages & jobs

  1. Compile and test

Build log

The build generated 572 lines of output. Download or view full build log

20-Feb-2020 10:19:04 Build Carrot2 - Attribute Binder - JDK 1.7 #32 (C2-BINDER-JDK17-32) started building on agent Local Agent 1
20-Feb-2020 10:19:04
20-Feb-2020 10:19:04 Build working directory is /var/atlassian/application-data/bamboo/xml-data/build-dir/C2-BINDER-JDK17
20-Feb-2020 10:19:04 Executing build Carrot2 - Attribute Binder - JDK 1.7 #32 (C2-BINDER-JDK17-32)
20-Feb-2020 10:19:04 Starting task 'Checkout Default Repository' of type 'com.atlassian.bamboo.plugins.vcs:task.vcs.checkout'
20-Feb-2020 10:19:04 Checking out into /var/atlassian/application-data/bamboo/xml-data/build-dir/C2-BINDER-JDK17
20-Feb-2020 10:19:04 Updating source code to revision: 16ba8011a0c65f871715dd2cc57a4038e1b255fb
20-Feb-2020 10:19:04 Fetching 'refs/heads/master' from 'https://github.com/carrot2/attributes-binder.git'.
20-Feb-2020 10:19:04 Checking out revision 16ba8011a0c65f871715dd2cc57a4038e1b255fb.
20-Feb-2020 10:19:04 From file:///var/atlassian/application-data/bamboo/xml-data/build-dir/_git-repositories-cache/33e4966cb21fb155e6841adbaadd4ca5ab39ba11
20-Feb-2020 10:19:04    a09bc03..16ba801  master     -> origin/master
20-Feb-2020 10:19:04 Already on 'master'
20-Feb-2020 10:19:04 Your branch is behind 'origin/master' by 2 commits, and can be fast-forwarded.
20-Feb-2020 10:19:04   (use "git pull" to update your local branch)
20-Feb-2020 10:19:04 HEAD is now at 16ba801 Bump version to 1.3.5-SNAPSHOT
20-Feb-2020 10:19:04 Updated source code to revision: 16ba8011a0c65f871715dd2cc57a4038e1b255fb
20-Feb-2020 10:19:04 Finished task 'Checkout Default Repository' with result: Success
20-Feb-2020 10:19:04 Running pre-build action: VCS Version Collector
20-Feb-2020 10:19:04 Starting task 'Maven 3.x' of type 'com.atlassian.bamboo.plugins.maven:task.builder.mvn3'
20-Feb-2020 10:19:04
Beginning to execute external process for build 'Carrot2 - Attribute Binder - JDK 1.7 #32 (C2-BINDER-JDK17-32)'
... running command line:
/home/bamboo/jvms/maven/bin/mvn --batch-mode -Djava.io.tmpdir=/opt/atlassian/bamboo/current/temp/C2-BINDER-JDK17 -Dmaven.repo.local=/var/atlassian/application-data/bamboo/.m2/AGENT-131073/repository clean verify
... in: /var/atlassian/application-data/bamboo/xml-data/build-dir/C2-BINDER-JDK17
... using extra environment variables:
bamboo_planRepository_1_branch=master
bamboo_carrotsearch_secure_staging_user=bamboo
bamboo_planRepository_1_branchDisplayName=master
bamboo_repository_revision_number=16ba8011a0c65f871715dd2cc57a4038e1b255fb
MAVEN2_HOME=/home/bamboo/jvms/maven
bamboo_capability_persistent_dir=/home/bamboo/persistent
bamboo_buildKey=C2-BINDER-JDK17
bamboo_capability_system_builder_command_rsync=rsync
bamboo_repository_65537_branch_name=master
bamboo_shortJobName=JDK 1.7
bamboo_buildResultsUrl=https://builds.carrot2.org/browse/C2-BINDER-JDK17-32
bamboo_planRepository_repositoryUrl=https://github.com/carrot2/attributes-binder.git
bamboo_agentId=131073
bamboo_carrotsearch_secure_staging_host=kappa.carrotsearch.com
bamboo_capability_system_jdk_JDK_9=/home/bamboo/jvms/jdk9
bamboo_planRepository_revision=16ba8011a0c65f871715dd2cc57a4038e1b255fb
bamboo_planRepository_previousRevision=a09bc039df599c021d9db682c0958965288cddff
bamboo_repository_branch_name=master
bamboo_carrotsearch_download_official_port=2233
bamboo_capability_system_jdk_JDK_10=/home/bamboo/jvms/jdk10
bamboo_carrot2_website_ssh=carrotse@get.carrotsearch.com:~/sites/project.carrot2.org
bamboo_csssprites_download_path=/srv/vhosts/get.csssprites.org
bamboo_carrotsearch_labs_ssh_port=2233
bamboo_carrot2_download_user=bamboo
JAVA_HOME=/home/bamboo/jvms/jdk7
bamboo_capability_tools_dir=/home/bamboo/tools
bamboo_carrotsearch_download_staging_host=kappa.carrotsearch.com
bamboo_carrotsearch_download_official_path=~/sites/get.carrotsearch.com
bamboo_planRepository_branch=master
bamboo_carrotsearch_secure2_ssh=carrotse@get.carrotsearch.com:~/sites/secure.carrotsearch.com
bamboo_capability_system_jdk_JDK_13=/home/bamboo/jvms/jdk13
bamboo_capability_system_jdk_JDK_11=/home/bamboo/jvms/jdk11
bamboo_planRepository_1_type=gitv2
bamboo_planRepository_branchName=master
bamboo_capability_system_jdk_JDK_12=/home/bamboo/jvms/jdk12
bamboo_capability_system_jdk_JDK_11_J9=/home/bamboo/jvms/jdk11-j9
bamboo_capability_system_jdk_JDK=/home/bamboo/jvms/jdk8
bamboo_repository_65537_git_username=
bamboo_hg_cache_directory=/var/atlassian/application-data/bamboo/xml-data/build-dir/_hg-repositories-cache
bamboo_planRepository_1_username=
bamboo_planRepository_type=gitv2
bamboo_carrot2_download_host=kappa.carrotsearch.com
bamboo_git_cache_directory=/var/atlassian/application-data/bamboo/xml-data/build-dir/_git-repositories-cache
bamboo_carrotsearch_download_staging_user=bamboo
useMavenReturnCode=false
bamboo_capability_system_builder_node_Node_js=/usr/bin/nodejs
bamboo_capability_system_builder_ant_Ant=/home/bamboo/jvms/ant1.9
bamboo_capability_system_builder_mvn3_Maven_3=/home/bamboo/jvms/maven
bamboo_tmp_directory=/var/atlassian/application-data/bamboo/temp
bamboo_planKey=C2-BINDER
bamboo_planRepository_username=
bamboo_carrotsearch_website_ssh=carrotse@get.carrotsearch.com:~/sites/www.carrotsearch.com
bamboo_capability_system_builder_command_yarn=/usr/bin/yarn
bamboo_planRepository_1_branchName=master
bamboo_resultsUrl=https://builds.carrot2.org/browse/C2-BINDER-JDK17-32
bamboo_capability_Linux=
bamboo_carrotsearch_labs_ssh=carrotse@get.carrotsearch.com:~/sites/labs.carrotsearch.com
bamboo_build_working_directory=/var/atlassian/application-data/bamboo/xml-data/build-dir/C2-BINDER-JDK17
bamboo_planRepository_1_name=github/carrot2/attributes-binder
bamboo_shortPlanName=Attribute Binder
bamboo_planRepository_name=github/carrot2/attributes-binder
bamboo_repository_65537_git_branch=master
bamboo_buildNumber=32
bamboo_repository_65537_revision_number=16ba8011a0c65f871715dd2cc57a4038e1b255fb
bamboo_carrotsearch_secure_staging_path=/srv/vhosts/staging-secure.carrotsearch.com
bamboo_carrotsearch_secure_ssh_port=2233
bamboo_planName=Carrot2 - Attribute Binder
bamboo_capability_system_builder_command_git=git
bamboo_shortPlanKey=BINDER
bamboo_shortJobKey=JDK17
bamboo_buildTimeStamp=2020-02-20T10:19:04.033+01:00
bamboo_repository_previous_revision_number=a09bc039df599c021d9db682c0958965288cddff
M2_HOME=/home/bamboo/jvms/maven
bamboo_repository_git_branch=master
bamboo_buildResultKey=C2-BINDER-JDK17-32
bamboo_buildPlanName=Carrot2 - Attribute Binder - JDK 1.7
bamboo_planRepository_1_revision=16ba8011a0c65f871715dd2cc57a4038e1b255fb
bamboo_repository_name=github/carrot2/attributes-binder
bamboo_carrot2_website_ssh_port=2233
bamboo_csssprites_download_host=kappa.carrotsearch.com
bamboo_repository_65537_previous_revision_number=a09bc039df599c021d9db682c0958965288cddff
bamboo_buildFailed=false
bamboo_repository_65537_name=github/carrot2/attributes-binder
bamboo_repository_65537_git_repositoryUrl=https://github.com/carrot2/attributes-binder.git
bamboo_agentWorkingDirectory=/var/atlassian/application-data/bamboo/xml-data/build-dir
bamboo_carrotsearch_download_official_host=get.carrotsearch.com
bamboo_capability_system_git_executable=/usr/bin/git
bamboo_l4g_mvn_opts=-Xmx1g
bamboo_repository_git_username=
bamboo_planRepository_1_previousRevision=a09bc039df599c021d9db682c0958965288cddff
bamboo_carrotsearch_download_staging_path=/srv/vhosts/staging-get.carrotsearch.com
bamboo_planRepository_branchDisplayName=master
bamboo_capability_corpora_dir=/home/bamboo/corpora
bamboo_csssprites_download_user=bamboo
bamboo_plan_storageTag=C2-BINDER
bamboo_carrot2_download_path=/srv/vhosts/get.carrot2.org
bamboo_repository_git_repositoryUrl=https://github.com/carrot2/attributes-binder.git
bamboo_carrotsearch_download_official_user=carrotse
bamboo_working_directory=/var/atlassian/application-data/bamboo/xml-data/build-dir/C2-BINDER-JDK17
bamboo_planRepository_1_repositoryUrl=https://github.com/carrot2/attributes-binder.git
bamboo_capability_system_jdk_JDK_1_8=/home/bamboo/jvms/jdk8
bamboo_capability_system_builder_command_zip=zip
bamboo_capability_system_jdk_JDK_1_9=/home/bamboo/jvms/jdk9
bamboo_capability_system_jdk_JDK_1_7=/home/bamboo/jvms/jdk7
bamboo_carrotsearch_secure_ssh=carrotse@get.carrotsearch.com:~/sites/secure.carrotsearch.com
bamboo_carrotsearch_website_ssh_port=2233
PATH=/home/bamboo/jvms/jdk7/bin:/usr/local/sbin:/usr/local/bin:/usr/sbin:/usr/bin:/sbin:/bin:/usr/games:/usr/local/games:/snap/bin
20-Feb-2020 10:19:05 [INFO] Scanning for projects...
20-Feb-2020 10:19:05 [WARNING] The project org.carrot2.attributes:attributes-parent:pom:1.3.5-SNAPSHOT uses prerequisites which is only intended for maven-plugin projects but not for non maven-plugin projects. For such purposes you should use the maven-enforcer-plugin. See https://maven.apache.org/enforcer/enforcer-rules/requireMavenVersion.html
20-Feb-2020 10:19:05 [INFO] ------------------------------------------------------------------------
20-Feb-2020 10:19:05 [INFO] Reactor Build Order:
20-Feb-2020 10:19:05 [INFO]
20-Feb-2020 10:19:05 [INFO] Attributes parent POM                                              [pom]
20-Feb-2020 10:19:05 [INFO] Attributes binder runtime                                          [jar]
20-Feb-2020 10:19:05 [INFO] Attributes metadata annotation processor                           [jar]
20-Feb-2020 10:19:05 [INFO] Attributes integration tests                                       [jar]
20-Feb-2020 10:19:05 [INFO]
20-Feb-2020 10:19:05 [INFO] --------------< org.carrot2.attributes:attributes-parent >--------------
20-Feb-2020 10:19:05 [INFO] Building Attributes parent POM 1.3.5-SNAPSHOT                      [1/4]
20-Feb-2020 10:19:05 [INFO] --------------------------------[ pom ]---------------------------------
20-Feb-2020 10:19:05 [INFO]
20-Feb-2020 10:19:05 [INFO] --- maven-clean-plugin:2.5:clean (default-clean) @ attributes-parent ---
20-Feb-2020 10:19:05 [INFO]
20-Feb-2020 10:19:05 [INFO] --- maven-enforcer-plugin:1.4.1:enforce (enforce-maven) @ attributes-parent ---
20-Feb-2020 10:19:06 [INFO]
20-Feb-2020 10:19:06 [INFO] --- maven-enforcer-plugin:1.4.1:enforce (enforce-environment) @ attributes-parent ---
20-Feb-2020 10:19:06 [INFO]
20-Feb-2020 10:19:06 [INFO] --------------< org.carrot2.attributes:attributes-binder >--------------
20-Feb-2020 10:19:06 [INFO] Building Attributes binder runtime 1.3.5-SNAPSHOT                  [2/4]
20-Feb-2020 10:19:06 [INFO] --------------------------------[ jar ]---------------------------------
20-Feb-2020 10:19:06 [INFO]
20-Feb-2020 10:19:06 [INFO] --- maven-clean-plugin:2.5:clean (default-clean) @ attributes-binder ---
20-Feb-2020 10:19:06 [INFO] Deleting /var/atlassian/application-data/bamboo/xml-data/build-dir/C2-BINDER-JDK17/attributes-binder/target
20-Feb-2020 10:19:06 [INFO]
20-Feb-2020 10:19:06 [INFO] --- maven-resources-plugin:2.6:resources (default-resources) @ attributes-binder ---
20-Feb-2020 10:19:06 [INFO] Using 'UTF-8' encoding to copy filtered resources.
20-Feb-2020 10:19:06 [INFO] skip non existing resourceDirectory /var/atlassian/application-data/bamboo/xml-data/build-dir/C2-BINDER-JDK17/attributes-binder/src/main/resources
20-Feb-2020 10:19:06 [INFO]
20-Feb-2020 10:19:06 [INFO] --- maven-compiler-plugin:3.3:compile (default-compile) @ attributes-binder ---
20-Feb-2020 10:19:06 [INFO] Changes detected - recompiling the module!
20-Feb-2020 10:19:06 [INFO] Compiling 57 source files to /var/atlassian/application-data/bamboo/xml-data/build-dir/C2-BINDER-JDK17/attributes-binder/target/classes
20-Feb-2020 10:19:07 [INFO]
20-Feb-2020 10:19:07 [INFO] --- maven-resources-plugin:2.6:testResources (default-testResources) @ attributes-binder ---
20-Feb-2020 10:19:07 [INFO] Using 'UTF-8' encoding to copy filtered resources.
20-Feb-2020 10:19:07 [INFO] skip non existing resourceDirectory /var/atlassian/application-data/bamboo/xml-data/build-dir/C2-BINDER-JDK17/attributes-binder/src/test/resources
20-Feb-2020 10:19:07 [INFO]
20-Feb-2020 10:19:07 [INFO] --- maven-compiler-plugin:3.3:testCompile (default-testCompile) @ attributes-binder ---
20-Feb-2020 10:19:07 [INFO] No sources to compile
20-Feb-2020 10:19:07 [INFO]
20-Feb-2020 10:19:07 [INFO] --- maven-surefire-plugin:2.12.4:test (default-test) @ attributes-binder ---
20-Feb-2020 10:19:07 [INFO] No tests to run.
20-Feb-2020 10:19:07 [INFO]
20-Feb-2020 10:19:07 [INFO] --- maven-jar-plugin:2.4:jar (default-jar) @ attributes-binder ---
20-Feb-2020 10:19:07 [INFO] Building jar: /var/atlassian/application-data/bamboo/xml-data/build-dir/C2-BINDER-JDK17/attributes-binder/target/attributes-binder-1.3.5-SNAPSHOT.jar
20-Feb-2020 10:19:07 [INFO]
20-Feb-2020 10:19:07 [INFO] ------------< org.carrot2.attributes:attributes-processor >-------------
20-Feb-2020 10:19:07 [INFO] Building Attributes metadata annotation processor 1.3.5-SNAPSHOT   [3/4]
20-Feb-2020 10:19:07 [INFO] --------------------------------[ jar ]---------------------------------
20-Feb-2020 10:19:07 [INFO]
20-Feb-2020 10:19:07 [INFO] --- maven-clean-plugin:2.5:clean (default-clean) @ attributes-processor ---
20-Feb-2020 10:19:07 [INFO] Deleting /var/atlassian/application-data/bamboo/xml-data/build-dir/C2-BINDER-JDK17/attributes-processor/target
20-Feb-2020 10:19:07 [INFO]
20-Feb-2020 10:19:07 [INFO] --- maven-resources-plugin:2.6:resources (default-resources) @ attributes-processor ---
20-Feb-2020 10:19:07 [INFO] Using 'UTF-8' encoding to copy filtered resources.
20-Feb-2020 10:19:07 [INFO] Copying 4 resources
20-Feb-2020 10:19:07 [INFO]
20-Feb-2020 10:19:07 [INFO] --- maven-compiler-plugin:3.3:compile (default-compile) @ attributes-processor ---
20-Feb-2020 10:19:07 [INFO] Changes detected - recompiling the module!
20-Feb-2020 10:19:07 [INFO] Compiling 12 source files to /var/atlassian/application-data/bamboo/xml-data/build-dir/C2-BINDER-JDK17/attributes-processor/target/classes
20-Feb-2020 10:19:07 [INFO] /var/atlassian/application-data/bamboo/xml-data/build-dir/C2-BINDER-JDK17/attributes-processor/src/main/java/org/carrot2/util/preprocessor/BuilderBase.java: /var/atlassian/application-data/bamboo/xml-data/build-dir/C2-BINDER-JDK17/attributes-processor/src/main/java/org/carrot2/util/preprocessor/BuilderBase.java uses or overrides a deprecated API.
20-Feb-2020 10:19:07 [INFO] /var/atlassian/application-data/bamboo/xml-data/build-dir/C2-BINDER-JDK17/attributes-processor/src/main/java/org/carrot2/util/preprocessor/BuilderBase.java: Recompile with -Xlint:deprecation for details.
20-Feb-2020 10:19:07 [INFO]
20-Feb-2020 10:19:07 [INFO] --- maven-resources-plugin:2.6:testResources (default-testResources) @ attributes-processor ---
20-Feb-2020 10:19:07 [INFO] Using 'UTF-8' encoding to copy filtered resources.
20-Feb-2020 10:19:07 [INFO] skip non existing resourceDirectory /var/atlassian/application-data/bamboo/xml-data/build-dir/C2-BINDER-JDK17/attributes-processor/src/test/resources
20-Feb-2020 10:19:07 [INFO]
20-Feb-2020 10:19:07 [INFO] --- maven-compiler-plugin:3.3:testCompile (default-testCompile) @ attributes-processor ---
20-Feb-2020 10:19:07 [INFO] No sources to compile
20-Feb-2020 10:19:07 [INFO]
20-Feb-2020 10:19:07 [INFO] --- maven-surefire-plugin:2.12.4:test (default-test) @ attributes-processor ---
20-Feb-2020 10:19:07 [INFO] No tests to run.
20-Feb-2020 10:19:07 [INFO]
20-Feb-2020 10:19:07 [INFO] --- maven-jar-plugin:2.4:jar (default-jar) @ attributes-processor ---
20-Feb-2020 10:19:07 [INFO] Building jar: /var/atlassian/application-data/bamboo/xml-data/build-dir/C2-BINDER-JDK17/attributes-processor/target/attributes-processor-1.3.5-SNAPSHOT.jar
20-Feb-2020 10:19:07 [INFO]
20-Feb-2020 10:19:07 [INFO] --- maven-shade-plugin:1.7:shade (default) @ attributes-processor ---
20-Feb-2020 10:19:07 [INFO] Including org.carrot2.attributes:attributes-binder:jar:1.3.5-SNAPSHOT in the shaded jar.
20-Feb-2020 10:19:07 [INFO] Including com.thoughtworks.qdox:qdox:jar:1.12.1 in the shaded jar.
20-Feb-2020 10:19:07 [INFO] Including org.apache.velocity:velocity-engine-core:jar:2.0 in the shaded jar.
20-Feb-2020 10:19:07 [INFO] Including org.apache.commons:commons-lang3:jar:3.5 in the shaded jar.
20-Feb-2020 10:19:07 [INFO] Excluding org.slf4j:slf4j-api:jar:1.7.25 from the shaded jar.
20-Feb-2020 10:19:07 [INFO] No artifact matching filter org.apache.velocity:velocity
20-Feb-2020 10:19:08 [INFO] Replacing original artifact with shaded artifact.
20-Feb-2020 10:19:08 [INFO] Replacing /var/atlassian/application-data/bamboo/xml-data/build-dir/C2-BINDER-JDK17/attributes-processor/target/attributes-processor-1.3.5-SNAPSHOT.jar with /var/atlassian/application-data/bamboo/xml-data/build-dir/C2-BINDER-JDK17/attributes-processor/target/attributes-processor-1.3.5-SNAPSHOT-shaded.jar
20-Feb-2020 10:19:08 [INFO]
20-Feb-2020 10:19:08 [INFO] --------------< org.carrot2.attributes:attributes-tests >---------------
20-Feb-2020 10:19:08 [INFO] Building Attributes integration tests 1.3.5-SNAPSHOT               [4/4]
20-Feb-2020 10:19:08 [INFO] --------------------------------[ jar ]---------------------------------
20-Feb-2020 10:19:08 [INFO]
20-Feb-2020 10:19:08 [INFO] --- maven-clean-plugin:2.5:clean (default-clean) @ attributes-tests ---
20-Feb-2020 10:19:08 [INFO] Deleting /var/atlassian/application-data/bamboo/xml-data/build-dir/C2-BINDER-JDK17/attributes-tests/target
20-Feb-2020 10:19:08 [INFO]
20-Feb-2020 10:19:08 [INFO] --- build-helper-maven-plugin:1.8:add-source (add-source) @ attributes-tests ---
20-Feb-2020 10:19:08 [INFO] Source directory: /var/atlassian/application-data/bamboo/xml-data/build-dir/C2-BINDER-JDK17/attributes-tests/target/src-generated added.
20-Feb-2020 10:19:08 [INFO]
20-Feb-2020 10:19:08 [INFO] --- maven-resources-plugin:2.6:resources (default-resources) @ attributes-tests ---
20-Feb-2020 10:19:08 [INFO] Using 'UTF-8' encoding to copy filtered resources.
20-Feb-2020 10:19:08 [INFO] skip non existing resourceDirectory /var/atlassian/application-data/bamboo/xml-data/build-dir/C2-BINDER-JDK17/attributes-tests/src/main/resources
20-Feb-2020 10:19:08 [INFO]
20-Feb-2020 10:19:08 [INFO] --- maven-compiler-plugin:3.3:compile (default-compile) @ attributes-tests ---
20-Feb-2020 10:19:08 [INFO] No sources to compile
20-Feb-2020 10:19:08 [INFO]
20-Feb-2020 10:19:08 [INFO] --- maven-processor-plugin:2.2.0:process-test (process-test) @ attributes-tests ---
20-Feb-2020 10:19:08 [INFO] Source directory: /var/atlassian/application-data/bamboo/xml-data/build-dir/C2-BINDER-JDK17/attributes-tests/target/src-generated added
20-Feb-2020 10:19:08 [INFO] No processors specified. Using default discovery mechanism.
20-Feb-2020 10:19:08 [INFO] javac option: -cp
20-Feb-2020 10:19:08 [INFO] javac option: /var/atlassian/application-data/bamboo/xml-data/build-dir/C2-BINDER-JDK17/attributes-processor/target/attributes-processor-1.3.5-SNAPSHOT.jar:/var/atlassian/application-data/bamboo/xml-data/build-dir/C2-BINDER-JDK17/attributes-binder/target/attributes-binder-1.3.5-SNAPSHOT.jar:/var/atlassian/application-data/bamboo/.m2/AGENT-131073/repository/com/thoughtworks/qdox/qdox/1.12.1/qdox-1.12.1.jar:/var/atlassian/application-data/bamboo/.m2/AGENT-131073/repository/org/apache/velocity/velocity-engine-core/2.0/velocity-engine-core-2.0.jar:/var/atlassian/application-data/bamboo/.m2/AGENT-131073/repository/org/apache/commons/commons-lang3/3.5/commons-lang3-3.5.jar:/var/atlassian/application-data/bamboo/.m2/AGENT-131073/repository/org/slf4j/slf4j-api/1.7.25/slf4j-api-1.7.25.jar:/var/atlassian/application-data/bamboo/.m2/AGENT-131073/repository/org/apache/maven/maven-plugin-api/3.0.1/maven-plugin-api-3.0.1.jar:/var/atlassian/application-data/bamboo/.m2/AGENT-131073/repository/org/apache/maven/maven-model/3.0.1/maven-model-3.0.1.jar:/var/atlassian/application-data/bamboo/.m2/AGENT-131073/repository/org/apache/maven/maven-artifact/3.0.1/maven-artifact-3.0.1.jar:/var/atlassian/application-data/bamboo/.m2/AGENT-131073/repository/org/sonatype/sisu/sisu-inject-plexus/1.4.3.1/sisu-inject-plexus-1.4.3.1.jar:/var/atlassian/application-data/bamboo/.m2/AGENT-131073/repository/org/sonatype/sisu/sisu-inject-bean/1.4.3.1/sisu-inject-bean-1.4.3.1.jar:/var/atlassian/application-data/bamboo/.m2/AGENT-131073/repository/org/sonatype/sisu/sisu-guice/2.9.1/sisu-guice-2.9.1-noaop.jar:/var/atlassian/application-data/bamboo/.m2/AGENT-131073/repository/org/apache/maven/maven-core/3.0.1/maven-core-3.0.1.jar:/var/atlassian/application-data/bamboo/.m2/AGENT-131073/repository/org/apache/maven/maven-settings/3.0.1/maven-settings-3.0.1.jar:/var/atlassian/application-data/bamboo/.m2/AGENT-131073/repository/org/apache/maven/maven-settings-builder/3.0.1/maven-settings-builder-3.0.1.jar:/var/atlassian/application-data/bamboo/.m2/AGENT-131073/repository/org/apache/maven/maven-repository-metadata/3.0.1/maven-repository-metadata-3.0.1.jar:/var/atlassian/application-data/bamboo/.m2/AGENT-131073/repository/org/apache/maven/maven-model-builder/3.0.1/maven-model-builder-3.0.1.jar:/var/atlassian/application-data/bamboo/.m2/AGENT-131073/repository/org/apache/maven/maven-aether-provider/3.0.1/maven-aether-provider-3.0.1.jar:/var/atlassian/application-data/bamboo/.m2/AGENT-131073/repository/org/sonatype/aether/aether-spi/1.8/aether-spi-1.8.jar:/var/atlassian/application-data/bamboo/.m2/AGENT-131073/repository/org/sonatype/aether/aether-impl/1.8/aether-impl-1.8.jar:/var/atlassian/application-data/bamboo/.m2/AGENT-131073/repository/org/sonatype/aether/aether-api/1.8/aether-api-1.8.jar:/var/atlassian/application-data/bamboo/.m2/AGENT-131073/repository/org/sonatype/aether/aether-util/1.8/aether-util-1.8.jar:/var/atlassian/application-data/bamboo/.m2/AGENT-131073/repository/org/codehaus/plexus/plexus-interpolation/1.14/plexus-interpolation-1.14.jar:/var/atlassian/application-data/bamboo/.m2/AGENT-131073/repository/org/codehaus/plexus/plexus-classworlds/2.4/plexus-classworlds-2.4.jar:/var/atlassian/application-data/bamboo/.m2/AGENT-131073/repository/org/codehaus/plexus/plexus-component-annotations/1.5.5/plexus-component-annotations-1.5.5.jar:/var/atlassian/application-data/bamboo/.m2/AGENT-131073/repository/org/sonatype/plexus/plexus-sec-dispatcher/1.3/plexus-sec-dispatcher-1.3.jar:/var/atlassian/application-data/bamboo/.m2/AGENT-131073/repository/org/sonatype/plexus/plexus-cipher/1.4/plexus-cipher-1.4.jar:/var/atlassian/application-data/bamboo/.m2/AGENT-131073/repository/org/apache/maven/plugin-tools/maven-plugin-annotations/3.1/maven-plugin-annotations-3.1.jar:/var/atlassian/application-data/bamboo/.m2/AGENT-131073/repository/org/codehaus/plexus/plexus-utils/3.0.1/plexus-utils-3.0.1.jar:/var/atlassian/application-data/bamboo/xml-data/build-dir/C2-BINDER-JDK17/attributes-tests/src/test/resources:/var/atlassian/application-data/bamboo/xml-data/build-dir/C2-BINDER-JDK17/attributes-tests/target/test-classes:/var/atlassian/application-data/bamboo/xml-data/build-dir/C2-BINDER-JDK17/attributes-tests/target/classes:/var/atlassian/application-data/bamboo/.m2/AGENT-131073/repository/com/carrotsearch/thirdparty/simple-xml-safe/2.7.1/simple-xml-safe-2.7.1.jar:/var/atlassian/application-data/bamboo/.m2/AGENT-131073/repository/org/carrot2/shaded/carrot2-guava/18.0/carrot2-guava-18.0.jar:/var/atlassian/application-data/bamboo/.m2/AGENT-131073/repository/junit/junit/4.10/junit-4.10.jar:/var/atlassian/application-data/bamboo/.m2/AGENT-131073/repository/org/hamcrest/hamcrest-core/1.1/hamcrest-core-1.1.jar:/var/atlassian/application-data/bamboo/.m2/AGENT-131073/repository/org/easytesting/fest-assert/1.4/fest-assert-1.4.jar:/var/atlassian/application-data/bamboo/.m2/AGENT-131073/repository/org/easytesting/fest-util/1.1.6/fest-util-1.1.6.jar:/var/atlassian/application-data/bamboo/.m2/AGENT-131073/repository/com/carrotsearch/randomizedtesting/randomizedtesting-runner/2.5.3/randomizedtesting-runner-2.5.3.jar:
20-Feb-2020 10:19:08 [INFO] javac option: -proc:only
20-Feb-2020 10:19:08 [INFO] javac option: -d
20-Feb-2020 10:19:08 [INFO] javac option: /var/atlassian/application-data/bamboo/xml-data/build-dir/C2-BINDER-JDK17/attributes-tests/target/test-classes
20-Feb-2020 10:19:08 [INFO] javac option: -s
20-Feb-2020 10:19:08 [INFO] javac option: /var/atlassian/application-data/bamboo/xml-data/build-dir/C2-BINDER-JDK17/attributes-tests/target/src-generated
20-Feb-2020 10:19:09 SLF4J: Failed to load class "org.slf4j.impl.StaticLoggerBinder".
20-Feb-2020 10:19:09 SLF4J: Defaulting to no-operation (NOP) logger implementation
20-Feb-2020 10:19:09 SLF4J: See http://www.slf4j.org/codes.html#StaticLoggerBinder for further details.
20-Feb-2020 10:19:09 62 @Bindable metadata processed in round 1 in 0.53 secs.
20-Feb-2020 10:19:09 [INFO] diagnostic warning: /var/atlassian/application-data/bamboo/.m2/AGENT-131073/repository/com/carrotsearch/thirdparty/simple-xml-safe/2.7.1/simple-xml-safe-2.7.1.jar(org/simpleframework/xml/core/Persister.class): major version 52 is newer than 51, the highest major version supported by this compiler.
20-Feb-2020 10:19:09   It is recommended that the compiler be upgraded.
20-Feb-2020 10:19:09 [INFO] diagnostic warning: /var/atlassian/application-data/bamboo/.m2/AGENT-131073/repository/com/carrotsearch/thirdparty/simple-xml-safe/2.7.1/simple-xml-safe-2.7.1.jar(org/simpleframework/xml/Root.class): major version 52 is newer than 51, the highest major version supported by this compiler.
20-Feb-2020 10:19:09   It is recommended that the compiler be upgraded.
20-Feb-2020 10:19:09 [INFO] diagnostic warning: /var/atlassian/application-data/bamboo/.m2/AGENT-131073/repository/com/carrotsearch/thirdparty/simple-xml-safe/2.7.1/simple-xml-safe-2.7.1.jar(org/simpleframework/xml/Attribute.class): major version 52 is newer than 51, the highest major version supported by this compiler.
20-Feb-2020 10:19:09   It is recommended that the compiler be upgraded.
20-Feb-2020 10:19:09 [INFO] diagnostic warning: /var/atlassian/application-data/bamboo/.m2/AGENT-131073/repository/com/carrotsearch/thirdparty/simple-xml-safe/2.7.1/simple-xml-safe-2.7.1.jar(org/simpleframework/xml/ElementList.class): major version 52 is newer than 51, the highest major version supported by this compiler.
20-Feb-2020 10:19:09   It is recommended that the compiler be upgraded.
20-Feb-2020 10:19:09 [INFO] diagnostic warning: /var/atlassian/application-data/bamboo/.m2/AGENT-131073/repository/com/carrotsearch/thirdparty/simple-xml-safe/2.7.1/simple-xml-safe-2.7.1.jar(org/simpleframework/xml/Element.class): major version 52 is newer than 51, the highest major version supported by this compiler.
20-Feb-2020 10:19:09   It is recommended that the compiler be upgraded.
20-Feb-2020 10:19:09 [INFO] diagnostic warning: /var/atlassian/application-data/bamboo/.m2/AGENT-131073/repository/com/carrotsearch/thirdparty/simple-xml-safe/2.7.1/simple-xml-safe-2.7.1.jar(org/simpleframework/xml/ElementMap.class): major version 52 is newer than 51, the highest major version supported by this compiler.
20-Feb-2020 10:19:09   It is recommended that the compiler be upgraded.
20-Feb-2020 10:19:09 [INFO] diagnostic warning: /var/atlassian/application-data/bamboo/.m2/AGENT-131073/repository/com/carrotsearch/thirdparty/simple-xml-safe/2.7.1/simple-xml-safe-2.7.1.jar(org/simpleframework/xml/core/Persister.class): major version 52 is newer than 51, the highest major version supported by this compiler.
20-Feb-2020 10:19:09   It is recommended that the compiler be upgraded.
20-Feb-2020 10:19:09 [INFO] diagnostic warning: /var/atlassian/application-data/bamboo/.m2/AGENT-131073/repository/com/carrotsearch/thirdparty/simple-xml-safe/2.7.1/simple-xml-safe-2.7.1.jar(org/simpleframework/xml/Root.class): major version 52 is newer than 51, the highest major version supported by this compiler.
20-Feb-2020 10:19:09   It is recommended that the compiler be upgraded.
20-Feb-2020 10:19:09 [INFO] diagnostic warning: /var/atlassian/application-data/bamboo/.m2/AGENT-131073/repository/com/carrotsearch/thirdparty/simple-xml-safe/2.7.1/simple-xml-safe-2.7.1.jar(org/simpleframework/xml/Attribute.class): major version 52 is newer than 51, the highest major version supported by this compiler.
20-Feb-2020 10:19:09   It is recommended that the compiler be upgraded.
20-Feb-2020 10:19:09 [INFO] diagnostic warning: /var/atlassian/application-data/bamboo/.m2/AGENT-131073/repository/com/carrotsearch/thirdparty/simple-xml-safe/2.7.1/simple-xml-safe-2.7.1.jar(org/simpleframework/xml/ElementList.class): major version 52 is newer than 51, the highest major version supported by this compiler.
20-Feb-2020 10:19:09   It is recommended that the compiler be upgraded.
20-Feb-2020 10:19:09 [INFO] diagnostic warning: /var/atlassian/application-data/bamboo/.m2/AGENT-131073/repository/com/carrotsearch/thirdparty/simple-xml-safe/2.7.1/simple-xml-safe-2.7.1.jar(org/simpleframework/xml/Element.class): major version 52 is newer than 51, the highest major version supported by this compiler.
20-Feb-2020 10:19:09   It is recommended that the compiler be upgraded.
20-Feb-2020 10:19:09 [INFO] diagnostic warning: /var/atlassian/application-data/bamboo/.m2/AGENT-131073/repository/com/carrotsearch/thirdparty/simple-xml-safe/2.7.1/simple-xml-safe-2.7.1.jar(org/simpleframework/xml/ElementMap.class): major version 52 is newer than 51, the highest major version supported by this compiler.
20-Feb-2020 10:19:09   It is recommended that the compiler be upgraded.
20-Feb-2020 10:19:09 [INFO] diagnostic warning: /var/atlassian/application-data/bamboo/.m2/AGENT-131073/repository/com/carrotsearch/thirdparty/simple-xml-safe/2.7.1/simple-xml-safe-2.7.1.jar(org/simpleframework/xml/core/Persister.class): major version 52 is newer than 51, the highest major version supported by this compiler.
20-Feb-2020 10:19:09   It is recommended that the compiler be upgraded.
20-Feb-2020 10:19:09 [INFO] diagnostic warning: /var/atlassian/application-data/bamboo/.m2/AGENT-131073/repository/com/carrotsearch/thirdparty/simple-xml-safe/2.7.1/simple-xml-safe-2.7.1.jar(org/simpleframework/xml/Root.class): major version 52 is newer than 51, the highest major version supported by this compiler.
20-Feb-2020 10:19:09   It is recommended that the compiler be upgraded.
20-Feb-2020 10:19:09 [INFO] diagnostic warning: /var/atlassian/application-data/bamboo/.m2/AGENT-131073/repository/com/carrotsearch/thirdparty/simple-xml-safe/2.7.1/simple-xml-safe-2.7.1.jar(org/simpleframework/xml/Attribute.class): major version 52 is newer than 51, the highest major version supported by this compiler.
20-Feb-2020 10:19:09   It is recommended that the compiler be upgraded.
20-Feb-2020 10:19:09 [INFO] diagnostic warning: /var/atlassian/application-data/bamboo/.m2/AGENT-131073/repository/com/carrotsearch/thirdparty/simple-xml-safe/2.7.1/simple-xml-safe-2.7.1.jar(org/simpleframework/xml/ElementList.class): major version 52 is newer than 51, the highest major version supported by this compiler.
20-Feb-2020 10:19:09   It is recommended that the compiler be upgraded.
20-Feb-2020 10:19:09 [INFO] diagnostic warning: /var/atlassian/application-data/bamboo/.m2/AGENT-131073/repository/com/carrotsearch/thirdparty/simple-xml-safe/2.7.1/simple-xml-safe-2.7.1.jar(org/simpleframework/xml/Element.class): major version 52 is newer than 51, the highest major version supported by this compiler.
20-Feb-2020 10:19:09   It is recommended that the compiler be upgraded.
20-Feb-2020 10:19:09 [INFO] diagnostic warning: /var/atlassian/application-data/bamboo/.m2/AGENT-131073/repository/com/carrotsearch/thirdparty/simple-xml-safe/2.7.1/simple-xml-safe-2.7.1.jar(org/simpleframework/xml/ElementMap.class): major version 52 is newer than 51, the highest major version supported by this compiler.
20-Feb-2020 10:19:09   It is recommended that the compiler be upgraded.
20-Feb-2020 10:19:09 [INFO]
20-Feb-2020 10:19:09 [INFO] --- maven-resources-plugin:2.6:testResources (default-testResources) @ attributes-tests ---
20-Feb-2020 10:19:09 [INFO] Using 'UTF-8' encoding to copy filtered resources.
20-Feb-2020 10:19:09 [INFO] skip non existing resourceDirectory /var/atlassian/application-data/bamboo/xml-data/build-dir/C2-BINDER-JDK17/attributes-tests/src/test/resources
20-Feb-2020 10:19:09 [INFO]
20-Feb-2020 10:19:09 [INFO] --- maven-compiler-plugin:3.3:testCompile (default-testCompile) @ attributes-tests ---
20-Feb-2020 10:19:09 [INFO] Changes detected - recompiling the module!
20-Feb-2020 10:19:09 [INFO] Compiling 124 source files to /var/atlassian/application-data/bamboo/xml-data/build-dir/C2-BINDER-JDK17/attributes-tests/target/test-classes
20-Feb-2020 10:19:10 [INFO]
20-Feb-2020 10:19:10 [INFO] --- maven-surefire-plugin:2.12:test (default-test) @ attributes-tests ---
20-Feb-2020 10:19:10 [INFO] Tests are skipped.
20-Feb-2020 10:19:10 [INFO]
20-Feb-2020 10:19:10 [INFO] --- maven-jar-plugin:2.4:jar (default-jar) @ attributes-tests ---
20-Feb-2020 10:19:10 [WARNING] JAR will be empty - no content was marked for inclusion!
20-Feb-2020 10:19:10 [INFO] Building jar: /var/atlassian/application-data/bamboo/xml-data/build-dir/C2-BINDER-JDK17/attributes-tests/target/attributes-tests-1.3.5-SNAPSHOT.jar
20-Feb-2020 10:19:10 [INFO]
20-Feb-2020 10:19:10 [INFO] --- junit4-maven-plugin:2.5.3:junit4 (integration-tests) @ attributes-tests ---
20-Feb-2020 10:19:16 [INFO] <JUnit4> says ᐊᐃ! Master seed: B666DD6E9D9EE608
20-Feb-2020 10:19:16 Executing 20 suites with 4 JVMs.
20-Feb-2020 10:19:16
20-Feb-2020 10:19:16 Started J1 PID(7343@kappa).
20-Feb-2020 10:19:16 Started J2 PID(7345@kappa).
20-Feb-2020 10:19:16 Started J3 PID(7346@kappa).
20-Feb-2020 10:19:16 Started J0 PID(7344@kappa).
20-Feb-2020 10:19:16 Suite: org.carrot2.util.attribute.constraint.ConstraintCreatorTest
20-Feb-2020 10:19:16 OK      0.02s J1 | ConstraintCreatorTest.testCreateMultipleConstraints
20-Feb-2020 10:19:16 OK      0.01s J1 | ConstraintCreatorTest.testCreateImplementationException
20-Feb-2020 10:19:16 OK      0.00s J1 | ConstraintCreatorTest.testCreateSingleConstraint
20-Feb-2020 10:19:16 OK      0.00s J1 | ConstraintCreatorTest.testIsConstraintAnnotation
20-Feb-2020 10:19:16 OK      0.00s J1 | ConstraintCreatorTest.testCreateImplementationSuccess
20-Feb-2020 10:19:16 Completed [1/20] on J1 in 0.08s, 5 tests
20-Feb-2020 10:19:16
20-Feb-2020 10:19:16 Suite: org.carrot2.util.attribute.constraint.DoubleRangeConstraintTest
20-Feb-2020 10:19:16 OK      0.02s J2 | DoubleRangeConstraintTest.testInvalidType
20-Feb-2020 10:19:16 OK      0.01s J2 | DoubleRangeConstraintTest.testMinBound
20-Feb-2020 10:19:16 OK      0.01s J2 | DoubleRangeConstraintTest.testOtherAssignableTypes
20-Feb-2020 10:19:16 OK      0.00s J2 | DoubleRangeConstraintTest.testMaxBound
20-Feb-2020 10:19:16 OK      0.00s J2 | DoubleRangeConstraintTest.testWithinRange
20-Feb-2020 10:19:16 OK      0.00s J2 | DoubleRangeConstraintTest.testGreaterThanMax
20-Feb-2020 10:19:16 OK      0.00s J2 | DoubleRangeConstraintTest.testLessThanMin
20-Feb-2020 10:19:16 OK      0.00s J2 | DoubleRangeConstraintTest.testNull
20-Feb-2020 10:19:16 Completed [2/20] on J2 in 0.09s, 8 tests
20-Feb-2020 10:19:16
20-Feb-2020 10:19:16 Suite: org.carrot2.util.attribute.constraint.ImplementingClassesConstraintTest
20-Feb-2020 10:19:16 OK      0.02s J3 | ImplementingClassesConstraintTest.testValidStrictType
20-Feb-2020 10:19:16 OK      0.00s J3 | ImplementingClassesConstraintTest.testNull
20-Feb-2020 10:19:16 OK      0.00s J3 | ImplementingClassesConstraintTest.testValidNonStrictType
20-Feb-2020 10:19:16 OK      0.00s J3 | ImplementingClassesConstraintTest.testInvalidNonStrictType
20-Feb-2020 10:19:16 OK      0.01s J3 | ImplementingClassesConstraintTest.testInvalidStrictType
20-Feb-2020 10:19:16 OK      0.00s J3 | ImplementingClassesConstraintTest.testInvalidType
20-Feb-2020 10:19:16 Completed [3/20] on J3 in 0.09s, 6 tests
20-Feb-2020 10:19:16
20-Feb-2020 10:19:16 Suite: org.carrot2.util.attribute.ConstraintTest
20-Feb-2020 10:19:16 OK      0.06s J0 | ConstraintTest.testStrictImplementingClasses
20-Feb-2020 10:19:16 OK      0.01s J0 | ConstraintTest.testViolatedStrictImplementingClasses
20-Feb-2020 10:19:16 OK      0.00s J0 | ConstraintTest.testNonStrictImplementingClasses
20-Feb-2020 10:19:16 Completed [4/20] on J0 in 0.11s, 3 tests
20-Feb-2020 10:19:16
20-Feb-2020 10:19:16 Suite: org.carrot2.util.attribute.AttributeBinderInjectorTest
20-Feb-2020 10:19:16 OK      0.01s J0 | AttributeBinderInjectorTest.testNoValuesToInject
20-Feb-2020 10:19:16 OK      0.01s J0 | AttributeBinderInjectorTest.testInjectionOfNonNullValues
20-Feb-2020 10:19:16 OK      0.00s J0 | AttributeBinderInjectorTest.testInjectionOfNullValues
20-Feb-2020 10:19:16 OK      0.00s J0 | AttributeBinderInjectorTest.testCompositeInjectionReceiver
20-Feb-2020 10:19:16 OK      0.00s J0 | AttributeBinderInjectorTest.testNoFieldsToReceiveInjection
20-Feb-2020 10:19:16 OK      0.00s J0 | AttributeBinderInjectorTest.staticFieldsInInjectionReceiverNotBound
20-Feb-2020 10:19:16 OK      0.00s J0 | AttributeBinderInjectorTest.testNullInjectionReceiver
20-Feb-2020 10:19:16 Completed [5/20] on J0 in 0.04s, 7 tests
20-Feb-2020 10:19:16
20-Feb-2020 10:19:16 Suite: org.carrot2.util.attribute.BindableDescriptorBuilderTest
20-Feb-2020 10:19:16 OK      0.05s J3 | BindableDescriptorBuilderTest.testBindableReferenceWithBoundValue
20-Feb-2020 10:19:16 ERROR   0.01s J3 | BindableDescriptorBuilderTest.testConcurrentSerialization <<<
20-Feb-2020 10:19:16    > Throwable #1: com.carrotsearch.randomizedtesting.UncaughtExceptionError: Captured an uncaught exception in thread: Thread[id=12, name=Thread-1, state=RUNNABLE, group=TGRP-BindableDescriptorBuilderTest]
20-Feb-2020 10:19:16    > Caused by: java.lang.UnsupportedClassVersionError: org/simpleframework/xml/core/Persister : Unsupported major.minor version 52.0
20-Feb-2020 10:19:16    >         at __randomizedtesting.SeedInfo.seed([B666DD6E9D9EE608]:0)
20-Feb-2020 10:19:16    >         at java.lang.ClassLoader.defineClass1(Native Method)
20-Feb-2020 10:19:16    >         at java.lang.ClassLoader.defineClass(ClassLoader.java:800)
20-Feb-2020 10:19:16    >         at java.security.SecureClassLoader.defineClass(SecureClassLoader.java:142)
20-Feb-2020 10:19:16    >         at java.net.URLClassLoader.defineClass(URLClassLoader.java:449)
20-Feb-2020 10:19:16    >         at java.net.URLClassLoader.access$100(URLClassLoader.java:71)
20-Feb-2020 10:19:16    >         at java.net.URLClassLoader$1.run(URLClassLoader.java:361)
20-Feb-2020 10:19:16    >         at java.net.URLClassLoader$1.run(URLClassLoader.java:355)
20-Feb-2020 10:19:16    >         at java.security.AccessController.doPrivileged(Native Method)
20-Feb-2020 10:19:16    >         at java.net.URLClassLoader.findClass(URLClassLoader.java:354)
20-Feb-2020 10:19:16    >         at java.lang.ClassLoader.loadClass(ClassLoader.java:425)
20-Feb-2020 10:19:16    >         at sun.misc.Launcher$AppClassLoader.loadClass(Launcher.java:308)
20-Feb-2020 10:19:16    >         at java.lang.ClassLoader.loadClass(ClassLoader.java:358)
20-Feb-2020 10:19:16    >         at org.carrot2.util.attribute.BindableDescriptorBuilderTest$1Serializer.run(BindableDescriptorBuilderTest.java:125)
20-Feb-2020 10:19:16    > Throwable #2: com.carrotsearch.randomizedtesting.UncaughtExceptionError: Captured an uncaught exception in thread: Thread[id=13, name=Thread-2, state=RUNNABLE, group=TGRP-BindableDescriptorBuilderTest]
20-Feb-2020 10:19:16    > Caused by: java.lang.UnsupportedClassVersionError: org/simpleframework/xml/core/Persister
20-Feb-2020 10:19:16    >         at __randomizedtesting.SeedInfo.seed([B666DD6E9D9EE608]:0)
20-Feb-2020 10:19:16    >         at org.carrot2.util.attribute.BindableDescriptorBuilderTest$1Serializer.run(BindableDescriptorBuilderTest.java:125)
20-Feb-2020 10:19:16 ERROR   0.01s J3 | BindableDescriptorBuilderTest.testArrayTypesInImplementingClasses <<<
20-Feb-2020 10:19:16    > Throwable #1: java.lang.UnsupportedClassVersionError: org/simpleframework/xml/core/Persister : Unsupported major.minor version 52.0
20-Feb-2020 10:19:16    >         at __randomizedtesting.SeedInfo.seed([B666DD6E9D9EE608:F834EC8384FCE99A]:0)
20-Feb-2020 10:19:16    >         at java.lang.ClassLoader.defineClass1(Native Method)
20-Feb-2020 10:19:16    >         at java.lang.ClassLoader.defineClass(ClassLoader.java:800)
20-Feb-2020 10:19:16    >         at java.security.SecureClassLoader.defineClass(SecureClassLoader.java:142)
20-Feb-2020 10:19:16    >         at java.net.URLClassLoader.defineClass(URLClassLoader.java:449)
20-Feb-2020 10:19:16    >         at java.net.URLClassLoader.access$100(URLClassLoader.java:71)
20-Feb-2020 10:19:16    >         at java.net.URLClassLoader$1.run(URLClassLoader.java:361)
20-Feb-2020 10:19:16    >         at java.net.URLClassLoader$1.run(URLClassLoader.java:355)
20-Feb-2020 10:19:16    >         at java.security.AccessController.doPrivileged(Native Method)
20-Feb-2020 10:19:16    >         at java.net.URLClassLoader.findClass(URLClassLoader.java:354)
20-Feb-2020 10:19:16    >         at java.lang.ClassLoader.loadClass(ClassLoader.java:425)
20-Feb-2020 10:19:16    >         at sun.misc.Launcher$AppClassLoader.loadClass(Launcher.java:308)
20-Feb-2020 10:19:16    >         at java.lang.ClassLoader.loadClass(ClassLoader.java:358)
20-Feb-2020 10:19:16    >         at org.carrot2.util.attribute.BindableDescriptorBuilderTest.testArrayTypesInImplementingClasses(BindableDescriptorBuilderTest.java:170)
20-Feb-2020 10:19:16    >         at sun.reflect.NativeMethodAccessorImpl.invoke0(Native Method)
20-Feb-2020 10:19:16    >         at sun.reflect.NativeMethodAccessorImpl.invoke(NativeMethodAccessorImpl.java:57)
20-Feb-2020 10:19:16    >         at sun.reflect.DelegatingMethodAccessorImpl.invoke(DelegatingMethodAccessorImpl.java:43)
20-Feb-2020 10:19:16    >         at java.lang.reflect.Method.invoke(Method.java:606)
20-Feb-2020 10:19:16    >         at com.carrotsearch.randomizedtesting.RandomizedRunner.invoke(RandomizedRunner.java:1737)
20-Feb-2020 10:19:16    >         at com.carrotsearch.randomizedtesting.RandomizedRunner$8.evaluate(RandomizedRunner.java:934)
20-Feb-2020 10:19:16    >         at com.carrotsearch.randomizedtesting.rules.StatementAdapter.evaluate(StatementAdapter.java:36)
20-Feb-2020 10:19:16    >         at com.carrotsearch.randomizedtesting.ThreadLeakControl$StatementRunner.run(ThreadLeakControl.java:368)
20-Feb-2020 10:19:16    >         at com.carrotsearch.randomizedtesting.ThreadLeakControl.forkTimeoutingTask(ThreadLeakControl.java:817)
20-Feb-2020 10:19:16    >         at com.carrotsearch.randomizedtesting.ThreadLeakControl$3.evaluate(ThreadLeakControl.java:468)
20-Feb-2020 10:19:16    >         at com.carrotsearch.randomizedtesting.RandomizedRunner.runSingleTest(RandomizedRunner.java:943)
20-Feb-2020 10:19:16    >         at com.carrotsearch.randomizedtesting.RandomizedRunner$5.evaluate(RandomizedRunner.java:829)
20-Feb-2020 10:19:16    >         at com.carrotsearch.randomizedtesting.RandomizedRunner$6.evaluate(RandomizedRunner.java:879)
20-Feb-2020 10:19:16    >         at com.carrotsearch.randomizedtesting.RandomizedRunner$7.evaluate(RandomizedRunner.java:890)
20-Feb-2020 10:19:16    >         at com.carrotsearch.randomizedtesting.rules.StatementAdapter.evaluate(StatementAdapter.java:36)
20-Feb-2020 10:19:16    >         at com.carrotsearch.randomizedtesting.ThreadLeakControl$StatementRunner.run(ThreadLeakControl.java:368)
20-Feb-2020 10:19:16    >         at com.carrotsearch.randomizedtesting.ThreadLeakControl.forkTimeoutingTask(ThreadLeakControl.java:817)
20-Feb-2020 10:19:16    >         at com.carrotsearch.randomizedtesting.ThreadLeakControl$2.evaluate(ThreadLeakControl.java:404)
20-Feb-2020 10:19:16    >         at com.carrotsearch.randomizedtesting.RandomizedRunner.runSuite(RandomizedRunner.java:705)
20-Feb-2020 10:19:16    >         at com.carrotsearch.randomizedtesting.RandomizedRunner.access$200(RandomizedRunner.java:139)
20-Feb-2020 10:19:16    >         at com.carrotsearch.randomizedtesting.RandomizedRunner$2.run(RandomizedRunner.java:626)
20-Feb-2020 10:19:16 OK      0.01s J3 | BindableDescriptorBuilderTest.testNonprimitiveAttribute
20-Feb-2020 10:19:16 OK      0.01s J3 | BindableDescriptorBuilderTest.testSubClass
20-Feb-2020 10:19:16 OK      0.01s J3 | BindableDescriptorBuilderTest.testSimpleComponent
20-Feb-2020 10:19:16 OK      0.00s J3 | BindableDescriptorBuilderTest.testCircularReference
20-Feb-2020 10:19:16 OK      0.00s J3 | BindableDescriptorBuilderTest.testBindableReferenceWithDefaultValue
20-Feb-2020 10:19:16 OK      0.00s J3 | BindableDescriptorBuilderTest.testNotBindable
20-Feb-2020 10:19:16 Completed [6/20 (1!)] on J3 in 0.11s, 9 tests, 2 errors <<< FAILURES!
20-Feb-2020 10:19:16
20-Feb-2020 10:19:16 Suite: org.carrot2.util.attribute.AttributeTransformerFromStringTest
20-Feb-2020 10:19:16 OK      0.01s J2 | AttributeTransformerFromStringTest.testExistingValueOfInteger
20-Feb-2020 10:19:16 OK      0.01s J2 | AttributeTransformerFromStringTest.testNonStringValue
20-Feb-2020 10:19:16 OK      0.00s J2 | AttributeTransformerFromStringTest.testExistingValueOfEnum
20-Feb-2020 10:19:16 OK      0.00s J2 | AttributeTransformerFromStringTest.testStringField
20-Feb-2020 10:19:16 OK      0.00s J2 | AttributeTransformerFromStringTest.testStringStrictlyAssignable
20-Feb-2020 10:19:16 OK      0.00s J2 | AttributeTransformerFromStringTest.testStringNotAssignable
20-Feb-2020 10:19:16 OK      0.00s J2 | AttributeTransformerFromStringTest.testNonLoadableClass
20-Feb-2020 10:19:16 OK      0.00s J2 | AttributeTransformerFromStringTest.testLoadableClass
20-Feb-2020 10:19:16 OK      0.00s J2 | AttributeTransformerFromStringTest.testStringNonStrictlyAssignable
20-Feb-2020 10:19:16 Completed [7/20 (1!)] on J2 in 0.05s, 9 tests
20-Feb-2020 10:19:16
20-Feb-2020 10:19:16 Suite: org.carrot2.util.attribute.constraint.IntModuloConstraintTest
20-Feb-2020 10:19:16 OK      0.01s J0 | IntModuloConstraintTest.testNotMet
20-Feb-2020 10:19:16 OK      0.00s J0 | IntModuloConstraintTest.testInvalidType
20-Feb-2020 10:19:16 OK      0.00s J0 | IntModuloConstraintTest.testNull
20-Feb-2020 10:19:16 OK      0.00s J0 | IntModuloConstraintTest.testOtherAssignableTypes
20-Feb-2020 10:19:16 OK      0.00s J0 | IntModuloConstraintTest.testMet
20-Feb-2020 10:19:16 Completed [8/20 (1!)] on J0 in 0.02s, 5 tests
20-Feb-2020 10:19:16
20-Feb-2020 10:19:16 Suite: org.carrot2.util.attribute.constraint.NotBlankConstraintTest
20-Feb-2020 10:19:16 OK      0.00s J0 | NotBlankConstraintTest.testValidString
20-Feb-2020 10:19:16 OK      0.00s J0 | NotBlankConstraintTest.testNull
20-Feb-2020 10:19:16 OK      0.00s J0 | NotBlankConstraintTest.testValidCharSequence
20-Feb-2020 10:19:16 OK      0.00s J0 | NotBlankConstraintTest.testInvalidCharSequence
20-Feb-2020 10:19:16 OK      0.00s J0 | NotBlankConstraintTest.testInvalidString
20-Feb-2020 10:19:16 OK      0.00s J0 | NotBlankConstraintTest.testInvalidType
20-Feb-2020 10:19:16 Completed [9/20 (1!)] on J0 in 0.04s, 6 tests
20-Feb-2020 10:19:16
20-Feb-2020 10:19:17 Suite: org.carrot2.util.attribute.AttributeBinderTest
20-Feb-2020 10:19:17 OK      0.05s J1 | AttributeBinderTest.testClassCoercionFromString
20-Feb-2020 10:19:17 OK      0.01s J1 | AttributeBinderTest.testOutputReferenceAttributeWithoutConstraint
20-Feb-2020 10:19:17 OK      0.01s J1 | AttributeBinderTest.testInputReferenceAttributeWithoutConstraint
20-Feb-2020 10:19:17 OK      0.01s J1 | AttributeBinderTest.testClassCoercion
20-Feb-2020 10:19:17 OK      0.01s J1 | AttributeBinderTest.testRequiredAttributeNullAttemptWithRequiredCheckingDisabled
20-Feb-2020 10:19:17 OK      0.01s J1 | AttributeBinderTest.testPrivateNestedAttributeClass
20-Feb-2020 10:19:17 OK      0.01s J1 | AttributeBinderTest.testCollectionInput
20-Feb-2020 10:19:17 OK      0.01s J1 | AttributeBinderTest.testFactoryAttrInstance
20-Feb-2020 10:19:17 OK      0.01s J1 | AttributeBinderTest.testDuplicateInputKeysAtDifferentLevels
20-Feb-2020 10:19:17 OK      0.01s J1 | AttributeBinderTest.testNonprimitiveOutputAttributeInputBinding
20-Feb-2020 10:19:17 OK      0.01s J1 | AttributeBinderTest.testClassValuedAttribute
20-Feb-2020 10:19:17 OK      0.01s J1 | AttributeBinderTest.testDuplicateOutputKeysAtDifferentLevels
20-Feb-2020 10:19:17 OK      0.01s J1 | AttributeBinderTest.testFactoryAttrClass
20-Feb-2020 10:19:17 OK      0.01s J1 | AttributeBinderTest.testDuplicateOutputKeysAtSameLevel
20-Feb-2020 10:19:17 OK      0.01s J1 | AttributeBinderTest.testCompoundConstraints
20-Feb-2020 10:19:17 OK      0.01s J1 | AttributeBinderTest.testRemainingAttributes
20-Feb-2020 10:19:17 OK      0.01s J1 | AttributeBinderTest.testNullReference
20-Feb-2020 10:19:17 OK      0.00s J1 | AttributeBinderTest.testDuplicateInputKeysAtSameLevel
20-Feb-2020 10:19:17 OK      0.01s J1 | AttributeBinderTest.testBindableHierarchyInput
20-Feb-2020 10:19:17 OK      0.01s J1 | AttributeBinderTest.testReferenceInput
20-Feb-2020 10:19:17 OK      0.01s J1 | AttributeBinderTest.testPrefixing
20-Feb-2020 10:19:17 OK      0.01s J1 | AttributeBinderTest.testRequiredInputAttributeNotProvided
20-Feb-2020 10:19:17 OK      0.01s J1 | AttributeBinderTest.testSingleClassUnbind
20-Feb-2020 10:19:17 OK      0.01s J1 | AttributeBinderTest.testBindableHierarchyOutput
20-Feb-2020 10:19:17 OK      0.01s J1 | AttributeBinderTest.testRequiredInputAttributeIsNull
20-Feb-2020 10:19:17 OK      0.01s J1 | AttributeBinderTest.testNoPublicConstructorAttributeClass
20-Feb-2020 10:19:17 OK      0.01s J1 | AttributeBinderTest.testEnumInput
20-Feb-2020 10:19:17 OK      0.01s J1 | AttributeBinderTest.testCircularReferences
20-Feb-2020 10:19:17 OK      0.00s J1 | AttributeBinderTest.testSingleClassInput
20-Feb-2020 10:19:17 OK      0.01s J1 | AttributeBinderTest.testTargetInvocationException
20-Feb-2020 10:19:17 OK      0.01s J1 | AttributeBinderTest.testFactoryAttrBuilderClass
20-Feb-2020 10:19:17 OK      0.01s J1 | AttributeBinderTest.testNotBindableCoercedAttribute
20-Feb-2020 10:19:17 OK      0.00s J1 | AttributeBinderTest.testRequiredAttributeAlreadyBound
20-Feb-2020 10:19:17 OK      0.00s J1 | AttributeBinderTest.testNotBindable
20-Feb-2020 10:19:17 OK      0.00s J1 | AttributeBinderTest.testRequiredAttributeNullAttempt
20-Feb-2020 10:19:17 OK      0.00s J1 | AttributeBinderTest.testOnlyBindingDirectionAnnotationProvided
20-Feb-2020 10:19:17 OK      0.00s J1 | AttributeBinderTest.testSingleClassOutput
20-Feb-2020 10:19:17 OK      0.00s J1 | AttributeBinderTest.testFactoryAttrBuilder
20-Feb-2020 10:19:17 OK      0.00s J1 | AttributeBinderTest.testSimpleConstraints
20-Feb-2020 10:19:17 OK      0.01s J1 | AttributeBinderTest.testNullInputAttributes
20-Feb-2020 10:19:17 OK      0.00s J1 | AttributeBinderTest.testPrivateStaticAttributeClass
20-Feb-2020 10:19:17 OK      0.00s J1 | AttributeBinderTest.testReferenceOutput
20-Feb-2020 10:19:17 OK      0.00s J1 | AttributeBinderTest.testAttributeAnnotationWithoutBindingDirection
20-Feb-2020 10:19:17 OK      0.00s J1 | AttributeBinderTest.testReferenceWithReferenceInstanceInAttributes
20-Feb-2020 10:19:17 Completed [10/20 (1!)] on J1 in 0.34s, 44 tests
20-Feb-2020 10:19:17
20-Feb-2020 10:19:17 Suite: org.carrot2.util.attribute.constraint.IntRangeConstraintTest
20-Feb-2020 10:19:17 OK      0.00s J1 | IntRangeConstraintTest.testInvalidType
20-Feb-2020 10:19:17 OK      0.00s J1 | IntRangeConstraintTest.testMinBound
20-Feb-2020 10:19:17 OK      0.00s J1 | IntRangeConstraintTest.testOtherAssignableTypes
20-Feb-2020 10:19:17 OK      0.00s J1 | IntRangeConstraintTest.testMaxBound
20-Feb-2020 10:19:17 OK      0.00s J1 | IntRangeConstraintTest.testWithinRange
20-Feb-2020 10:19:17 OK      0.00s J1 | IntRangeConstraintTest.testGreaterThanMax
20-Feb-2020 10:19:17 OK      0.00s J1 | IntRangeConstraintTest.testLessThanMin
20-Feb-2020 10:19:17 OK      0.00s J1 | IntRangeConstraintTest.testNull
20-Feb-2020 10:19:17 Completed [11/20 (1!)] on J1 in 0.02s, 8 tests
20-Feb-2020 10:19:17
20-Feb-2020 10:19:17 Suite: org.carrot2.util.attribute.constraint.PassesValueOfConstraintTest
20-Feb-2020 10:19:17 OK      0.00s J1 | PassesValueOfConstraintTest.testInvalidType
20-Feb-2020 10:19:17 OK      0.00s J1 | PassesValueOfConstraintTest.testValid
20-Feb-2020 10:19:17 Completed [12/20 (1!)] on J1 in 0.01s, 2 tests
20-Feb-2020 10:19:17
20-Feb-2020 10:19:17 Suite: org.carrot2.util.attribute.BindableDescriptorGeneratorTest
20-Feb-2020 10:19:17 OK      0.02s J0 | BindableDescriptorGeneratorTest.testKeysC
20-Feb-2020 10:19:17 OK      0.00s J0 | BindableDescriptorGeneratorTest.testAttributesC
20-Feb-2020 10:19:17 OK      0.00s J0 | BindableDescriptorGeneratorTest.testInputOutputGettersSetters
20-Feb-2020 10:19:17 OK      0.00s J0 | BindableDescriptorGeneratorTest.testAttributeDescriptorsC
20-Feb-2020 10:19:17 OK      0.00s J0 | BindableDescriptorGeneratorTest.testKeyInKeyCheck
20-Feb-2020 10:19:17 OK      0.00s J0 | BindableDescriptorGeneratorTest.testAttributeBuilderC
20-Feb-2020 10:19:17 OK      0.00s J0 | BindableDescriptorGeneratorTest.testOwnAttributesC
20-Feb-2020 10:19:17 Completed [13/20 (1!)] on J0 in 0.04s, 7 tests
20-Feb-2020 10:19:17
20-Feb-2020 10:19:17 Suite: org.carrot2.util.attribute.BindableDescriptorTest
20-Feb-2020 10:19:17 OK      0.02s J1 | BindableDescriptorTest.testOnlyInitProcessing
20-Feb-2020 10:19:17 OK      0.00s J1 | BindableDescriptorTest.testOnlyInputOutputInitProcessing
20-Feb-2020 10:19:17 OK      0.00s J1 | BindableDescriptorTest.testInputByLevel
20-Feb-2020 10:19:17 OK      0.01s J1 | BindableDescriptorTest.testOnlyInput
20-Feb-2020 10:19:17 OK      0.00s J1 | BindableDescriptorTest.testDefaultValues
20-Feb-2020 10:19:17 OK      0.00s J1 | BindableDescriptorTest.testAllByLevel
20-Feb-2020 10:19:17 OK      0.00s J1 | BindableDescriptorTest.testOnlyWithNoCriteria
20-Feb-2020 10:19:17 OK      0.00s J1 | BindableDescriptorTest.testFlatten
20-Feb-2020 10:19:17 OK      0.00s J1 | BindableDescriptorTest.testNotInput
20-Feb-2020 10:19:17 OK      0.00s J1 | BindableDescriptorTest.testAllByGroup
20-Feb-2020 10:19:17 OK      0.00s J1 | BindableDescriptorTest.testOnlyInputOutput
20-Feb-2020 10:19:17 OK      0.00s J1 | BindableDescriptorTest.testNotInputProcessing
20-Feb-2020 10:19:17 OK      0.00s J1 | BindableDescriptorTest.testOnlyInputProcessing
20-Feb-2020 10:19:17 OK      0.00s J1 | BindableDescriptorTest.testAllByStructure
20-Feb-2020 10:19:17 OK      0.00s J1 | BindableDescriptorTest.testProcessingByGroup
20-Feb-2020 10:19:17 OK      0.00s J1 | BindableDescriptorTest.testEmptyGroupsAfterFiltering
20-Feb-2020 10:19:17 OK      0.00s J1 | BindableDescriptorTest.testRepeatedGrouping
20-Feb-2020 10:19:17 Completed [14/20 (1!)] on J1 in 0.07s, 17 tests
20-Feb-2020 10:19:17
20-Feb-2020 10:19:17 Suite: org.carrot2.util.attribute.BindableDescriptorUtilsTest
20-Feb-2020 10:19:17 OK      0.00s J0 | BindableDescriptorUtilsTest.testGetDescriptorClassName
20-Feb-2020 10:19:17 Completed [15/20 (1!)] on J0 in 0.01s, 1 test
20-Feb-2020 10:19:17
20-Feb-2020 10:19:17 Suite: org.carrot2.util.attribute.BindableMetadataBuilderTest
20-Feb-2020 10:19:17 OK      0.01s J1 | BindableMetadataBuilderTest.testMultiSentenceLabel
20-Feb-2020 10:19:17 OK      0.01s J1 | BindableMetadataBuilderTest.testEmptyTitle
20-Feb-2020 10:19:17 OK      0.00s J1 | BindableMetadataBuilderTest.testTitleWithLink
20-Feb-2020 10:19:17 OK      0.00s J1 | BindableMetadataBuilderTest.testSingleWordLabel
20-Feb-2020 10:19:17 OK      0.00s J1 | BindableMetadataBuilderTest.testDescriptionWithExtraSpace
20-Feb-2020 10:19:17 OK      0.00s J1 | BindableMetadataBuilderTest.testMultiWordLabel
20-Feb-2020 10:19:17 OK      0.00s J1 | BindableMetadataBuilderTest.testMultiWordGroup
20-Feb-2020 10:19:17 OK      0.00s J1 | BindableMetadataBuilderTest.testNoDescriptionNoTitle
20-Feb-2020 10:19:17 OK      0.00s J1 | BindableMetadataBuilderTest.testOneWordGroup
20-Feb-2020 10:19:17 OK      0.00s J1 | BindableMetadataBuilderTest.testTitleWithExtraSpace
20-Feb-2020 10:19:17 OK      0.00s J1 | BindableMetadataBuilderTest.testNoLevel
20-Feb-2020 10:19:17 OK      0.00s J1 | BindableMetadataBuilderTest.testDescriptionWithNumericEntities
20-Feb-2020 10:19:17 OK      0.01s J1 | BindableMetadataBuilderTest.testNonPublicBindables
20-Feb-2020 10:19:17 OK      0.00s J1 | BindableMetadataBuilderTest.testTwoSentenceDescription
20-Feb-2020 10:19:17 OK      0.00s J1 | BindableMetadataBuilderTest.testLabelWithComment
20-Feb-2020 10:19:17 OK      0.00s J1 | BindableMetadataBuilderTest.testTitleWithDescription
20-Feb-2020 10:19:17 OK      0.01s J1 | BindableMetadataBuilderTest.testNamedAttributeNoJavadoc
20-Feb-2020 10:19:17 OK      0.00s J1 | BindableMetadataBuilderTest.testEmptyJavadoc
20-Feb-2020 10:19:17 OK      0.00s J1 | BindableMetadataBuilderTest.testTitleWithExtraPeriods
20-Feb-2020 10:19:17 OK      0.00s J1 | BindableMetadataBuilderTest.testNonPublicAttributes
20-Feb-2020 10:19:17 OK      0.00s J1 | BindableMetadataBuilderTest.testBindableMetadata
20-Feb-2020 10:19:17 OK      0.00s J1 | BindableMetadataBuilderTest.testBasicLevel
20-Feb-2020 10:19:17 OK      0.00s J1 | BindableMetadataBuilderTest.testMediumLevel
20-Feb-2020 10:19:17 OK      0.00s J1 | BindableMetadataBuilderTest.testSingleSentenceDescription
20-Feb-2020 10:19:17 OK      0.00s J1 | BindableMetadataBuilderTest.testLabelNotDefined
20-Feb-2020 10:19:17 OK      0.00s J1 | BindableMetadataBuilderTest.testNamedAttributeNoDotInKey
20-Feb-2020 10:19:17 OK      0.00s J1 | BindableMetadataBuilderTest.testNamedAttributeTitleOverride
20-Feb-2020 10:19:17 OK      0.00s J1 | BindableMetadataBuilderTest.testTitleWithExclamationMark
20-Feb-2020 10:19:17 OK      0.00s J1 | BindableMetadataBuilderTest.testTitleWithLabel
20-Feb-2020 10:19:17 OK      0.00s J1 | BindableMetadataBuilderTest.testNoGroup
20-Feb-2020 10:19:17 OK      0.00s J1 | BindableMetadataBuilderTest.testNoTitle
20-Feb-2020 10:19:17 OK      0.00s J1 | BindableMetadataBuilderTest.testNoDescription
20-Feb-2020 10:19:17 OK      0.00s J1 | BindableMetadataBuilderTest.testLabelDefined
20-Feb-2020 10:19:17 OK      0.00s J1 | BindableMetadataBuilderTest.testTitleWithoutPeriod
20-Feb-2020 10:19:17 OK      0.00s J1 | BindableMetadataBuilderTest.testDescriptionWithLinks
20-Feb-2020 10:19:17 OK      0.00s J1 | BindableMetadataBuilderTest.testNamedAttributeTitleDescriptionOverride
20-Feb-2020 10:19:17 OK      0.00s J1 | BindableMetadataBuilderTest.testAdvancedLevel
20-Feb-2020 10:19:17 OK      0.00s J1 | BindableMetadataBuilderTest.testTitleWithPeriod
20-Feb-2020 10:19:17 OK      0.00s J1 | BindableMetadataBuilderTest.testMixedPrivateAndStaticFields
20-Feb-2020 10:19:17 OK      0.00s J1 | BindableMetadataBuilderTest.testNamedAttributeLabelOverride
20-Feb-2020 10:19:17 Completed [16/20 (1!)] on J1 in 0.12s, 40 tests
20-Feb-2020 10:19:17
20-Feb-2020 10:19:21 Suite: org.carrot2.util.attribute.constraint.IsFileConstraintTest
20-Feb-2020 10:19:21 OK      5.02s J3 | IsFileConstraintTest.testInvalidType
20-Feb-2020 10:19:21 OK      0.00s J3 | IsFileConstraintTest.testMustExistMet
20-Feb-2020 10:19:21 OK      0.00s J3 | IsFileConstraintTest.testMustExistNotMetNonExisting
20-Feb-2020 10:19:21 OK      0.00s J3 | IsFileConstraintTest.testDoesNotHaveToExistNotMetExistingDirectory
20-Feb-2020 10:19:21 OK      0.00s J3 | IsFileConstraintTest.testNull
20-Feb-2020 10:19:21 OK      0.00s J3 | IsFileConstraintTest.testDoesNotHaveToExistMet
20-Feb-2020 10:19:21 OK      0.00s J3 | IsFileConstraintTest.testDoesNotHaveToExistMetNonExisting
20-Feb-2020 10:19:21 OK      0.00s J3 | IsFileConstraintTest.testMustExistNotMetExistingDirectory
20-Feb-2020 10:19:21 Completed [17/20 (1!)] on J3 in 5.04s, 8 tests
20-Feb-2020 10:19:21
20-Feb-2020 10:19:21 Suite: org.carrot2.util.attribute.constraint.ValueHintWithMappedValuesConstraintTest
20-Feb-2020 10:19:21 OK      0.00s J3 | ValueHintWithMappedValuesConstraintTest.testHintValue
20-Feb-2020 10:19:21 OK      0.00s J3 | ValueHintWithMappedValuesConstraintTest.testNull
20-Feb-2020 10:19:21 OK      0.00s J3 | ValueHintWithMappedValuesConstraintTest.testInvalidType
20-Feb-2020 10:19:21 OK      0.00s J3 | ValueHintWithMappedValuesConstraintTest.testNotHintValue
20-Feb-2020 10:19:21 Completed [18/20 (1!)] on J3 in 0.01s, 4 tests
20-Feb-2020 10:19:21
20-Feb-2020 10:19:21 Suite: org.carrot2.util.attribute.constraint.IsDirectoryConstraintTest
20-Feb-2020 10:19:21 OK      5.02s J2 | IsDirectoryConstraintTest.testInvalidType
20-Feb-2020 10:19:21 OK      0.00s J2 | IsDirectoryConstraintTest.testMustExistMet
20-Feb-2020 10:19:21 OK      0.00s J2 | IsDirectoryConstraintTest.testMustExistNotMetNonExisting
20-Feb-2020 10:19:21 OK      0.00s J2 | IsDirectoryConstraintTest.testDoesNotHaveToExistNotMetExistingFile
20-Feb-2020 10:19:21 OK      0.00s J2 | IsDirectoryConstraintTest.testNull
20-Feb-2020 10:19:21 OK      0.00s J2 | IsDirectoryConstraintTest.testDoesNotHaveToExistMetExistingDirectory
20-Feb-2020 10:19:21 OK      0.00s J2 | IsDirectoryConstraintTest.testDoesNotHaveToExistMetNonExisting
20-Feb-2020 10:19:21 OK      0.00s J2 | IsDirectoryConstraintTest.testMustExistNotMetExistingFile
20-Feb-2020 10:19:21 Completed [19/20 (1!)] on J2 in 5.04s, 8 tests
20-Feb-2020 10:19:21
20-Feb-2020 10:19:21 Suite: org.carrot2.util.attribute.constraint.ValueHintConstraintTest
20-Feb-2020 10:19:21 OK      0.00s J2 | ValueHintConstraintTest.testHintValue
20-Feb-2020 10:19:21 OK      0.00s J2 | ValueHintConstraintTest.testOtherValues
20-Feb-2020 10:19:21 OK      0.00s J2 | ValueHintConstraintTest.testInvalidType
20-Feb-2020 10:19:21 OK      0.00s J2 | ValueHintConstraintTest.testNull
20-Feb-2020 10:19:21 Completed [20/20 (1!)] on J2 in 0.01s, 4 tests
20-Feb-2020 10:19:21
20-Feb-2020 10:19:22
20-Feb-2020 10:19:22 Tests with failures [seed: B666DD6E9D9EE608]:
20-Feb-2020 10:19:22   - org.carrot2.util.attribute.BindableDescriptorBuilderTest.testConcurrentSerialization
20-Feb-2020 10:19:22   - org.carrot2.util.attribute.BindableDescriptorBuilderTest.testArrayTypesInImplementingClasses
20-Feb-2020 10:19:22
20-Feb-2020 10:19:22
20-Feb-2020 10:19:22 [INFO] JVM J0:     0.31 ..     1.48 =     1.17s
20-Feb-2020 10:19:22 [INFO] JVM J1:     0.31 ..     1.73 =     1.42s
20-Feb-2020 10:19:22 [INFO] JVM J2:     0.31 ..     5.96 =     5.65s
20-Feb-2020 10:19:22 [INFO] JVM J3:     0.31 ..     5.95 =     5.64s
20-Feb-2020 10:19:22 [INFO] Execution time total: 5.97 sec.
20-Feb-2020 10:19:22 [INFO] Tests summary: 20 suites, 201 tests, 2 errors
20-Feb-2020 10:19:22 [INFO] ------------------------------------------------------------------------
20-Feb-2020 10:19:22 [INFO] Reactor Summary for Attributes parent POM 1.3.5-SNAPSHOT:
20-Feb-2020 10:19:22 [INFO]
20-Feb-2020 10:19:22 [INFO] Attributes parent POM .............................. SUCCESS [  0.437 s]
20-Feb-2020 10:19:22 [INFO] Attributes binder runtime .......................... SUCCESS [  1.160 s]
20-Feb-2020 10:19:22 [INFO] Attributes metadata annotation processor ........... SUCCESS [  1.242 s]
20-Feb-2020 10:19:22 [INFO] Attributes integration tests ....................... FAILURE [ 13.412 s]
20-Feb-2020 10:19:22 [INFO] ------------------------------------------------------------------------
20-Feb-2020 10:19:22 [INFO] BUILD FAILURE
20-Feb-2020 10:19:22 [INFO] ------------------------------------------------------------------------
20-Feb-2020 10:19:22 [INFO] Total time:  16.374 s
20-Feb-2020 10:19:22 [INFO] Finished at: 2020-02-20T10:19:22+01:00
20-Feb-2020 10:19:22 [INFO] ------------------------------------------------------------------------
20-Feb-2020 10:19:22 [ERROR] Failed to execute goal com.carrotsearch.randomizedtesting:junit4-maven-plugin:2.5.3:junit4 (integration-tests) on project attributes-tests: There were test failures: 20 suites, 201 tests, 2 errors [seed: B666DD6E9D9EE608] -> [Help 1]
20-Feb-2020 10:19:22 [ERROR]
20-Feb-2020 10:19:22 [ERROR] To see the full stack trace of the errors, re-run Maven with the -e switch.
20-Feb-2020 10:19:22 [ERROR] Re-run Maven using the -X switch to enable full debug logging.
20-Feb-2020 10:19:22 [ERROR]
20-Feb-2020 10:19:22 [ERROR] For more information about the errors and possible solutions, please read the following articles:
20-Feb-2020 10:19:22 [ERROR] [Help 1] http://cwiki.apache.org/confluence/display/MAVEN/MojoExecutionException
20-Feb-2020 10:19:22 [ERROR]
20-Feb-2020 10:19:22 [ERROR] After correcting the problems, you can resume the build with the command
20-Feb-2020 10:19:22 [ERROR]   mvn <goals> -rf :attributes-tests
20-Feb-2020 10:19:22 Failing task since return code of [/home/bamboo/jvms/maven/bin/mvn --batch-mode -Djava.io.tmpdir=/opt/atlassian/bamboo/current/temp/C2-BINDER-JDK17 -Dmaven.repo.local=/var/atlassian/application-data/bamboo/.m2/AGENT-131073/repository clean verify] was 1 while expected 0
20-Feb-2020 10:19:22 Parsing test results under /var/atlassian/application-data/bamboo/xml-data/build-dir/C2-BINDER-JDK17...
20-Feb-2020 10:19:22 Finished task 'Maven 3.x' with result: Failed
20-Feb-2020 10:19:22 Running post build plugin 'NCover Results Collector'
20-Feb-2020 10:19:22 Running post build plugin 'Artifact Copier'
20-Feb-2020 10:19:22 Running post build plugin 'npm Cache Cleanup'
20-Feb-2020 10:19:22 Running post build plugin 'Clover Results Collector'
20-Feb-2020 10:19:22 Running post build plugin 'Docker Container Cleanup'
20-Feb-2020 10:19:22 Finalising the build...
20-Feb-2020 10:19:22 Stopping timer.
20-Feb-2020 10:19:22 Build C2-BINDER-JDK17-32 completed.
20-Feb-2020 10:19:22 Running on server: post build plugin 'NCover Results Collector'
20-Feb-2020 10:19:22 Running on server: post build plugin 'Build Hanging Detection Configuration'
20-Feb-2020 10:19:22 Running on server: post build plugin 'Clover Delta Calculator'
20-Feb-2020 10:19:22 Running on server: post build plugin 'Maven Dependencies Postprocessor'
20-Feb-2020 10:19:22 All post build plugins have finished
20-Feb-2020 10:19:22 Generating build results summary...
20-Feb-2020 10:19:23 Saving build results to disk...
20-Feb-2020 10:19:23 Logging substituted variables...
20-Feb-2020 10:19:23 Indexing build results...
20-Feb-2020 10:19:23 Finished building C2-BINDER-JDK17-32.