Build: #28 failed

Job: JDK 1.7 failed

Stages & jobs

  1. Compile and test

Build log

The build generated 680 lines of output. Download or view full build log

10-May-2018 13:05:43 Build Carrot2 - Attribute Binder - JDK 1.7 #28 (C2-BINDER-JDK17-28) started building on agent Local Agent 2
10-May-2018 13:05:43
10-May-2018 13:05:43 Build working directory is /var/atlassian/application-data/bamboo/xml-data/build-dir/C2-BINDER-JDK17
10-May-2018 13:05:43 Executing build Carrot2 - Attribute Binder - JDK 1.7 #28 (C2-BINDER-JDK17-28)
10-May-2018 13:05:43 Starting task 'Checkout Default Repository' of type 'com.atlassian.bamboo.plugins.vcs:task.vcs.checkout'
10-May-2018 13:05:43 Checking out into /var/atlassian/application-data/bamboo/xml-data/build-dir/C2-BINDER-JDK17
10-May-2018 13:05:43 Updating source code to revision: 9e303a94e5221db55e3fcb576e927fe08299eb96
10-May-2018 13:05:43 Fetching 'refs/heads/master' from 'https://github.com/carrot2/attributes-binder.git'.
10-May-2018 13:05:43 Checking out revision 9e303a94e5221db55e3fcb576e927fe08299eb96.
10-May-2018 13:05:43 Creating local git repository in '/var/atlassian/application-data/bamboo/xml-data/build-dir/C2-BINDER-JDK17/.git'.
10-May-2018 13:05:43 Cloning into '/var/atlassian/application-data/bamboo/xml-data/build-dir/C2-BINDER-JDK17'...
10-May-2018 13:05:43 done.
10-May-2018 13:05:43 Already on 'master'
10-May-2018 13:05:43 Your branch is up to date with 'origin/master'.
10-May-2018 13:05:43 Updated source code to revision: 9e303a94e5221db55e3fcb576e927fe08299eb96
10-May-2018 13:05:43 Finished task 'Checkout Default Repository' with result: Success
10-May-2018 13:05:43 Running pre-build action: VCS Version Collector
10-May-2018 13:05:43 Starting task 'Maven 3.x' of type 'com.atlassian.bamboo.plugins.maven:task.builder.mvn3'
10-May-2018 13:05:43
Beginning to execute external process for build 'Carrot2 - Attribute Binder - JDK 1.7 #28 (C2-BINDER-JDK17-28)'
... running command line:
/home/bamboo/tools/apache-maven-3.5.2/bin/mvn --batch-mode -Djava.io.tmpdir=/opt/atlassian/bamboo/current/temp/C2-BINDER-JDK17 -Dmaven.repo.local=/var/atlassian/application-data/bamboo/.m2/AGENT-61702145/repository clean verify
... in: /var/atlassian/application-data/bamboo/xml-data/build-dir/C2-BINDER-JDK17
... using extra environment variables:
bamboo_planRepository_1_branch=master
bamboo_planRepository_1_branchDisplayName=master
bamboo_repository_revision_number=9e303a94e5221db55e3fcb576e927fe08299eb96
MAVEN2_HOME=/home/bamboo/tools/apache-maven-3.5.2
bamboo_capability_persistent_dir=/home/bamboo/persistent
bamboo_buildKey=C2-BINDER-JDK17
bamboo_capability_system_builder_command_rsync=rsync
bamboo_repository_65537_branch_name=master
bamboo_shortJobName=JDK 1.7
bamboo_buildResultsUrl=https://builds.carrot2.org/browse/C2-BINDER-JDK17-28
bamboo_planRepository_repositoryUrl=https://github.com/carrot2/attributes-binder.git
bamboo_agentId=61702145
bamboo_capability_system_jdk_JDK_9=/home/bamboo/jvms/jdk9
bamboo_planRepository_revision=9e303a94e5221db55e3fcb576e927fe08299eb96
bamboo_planRepository_previousRevision=a60025d54fd92503b71bd0213b79e534f1f41c7c
bamboo_repository_branch_name=master
bamboo_carrotsearch_download_official_port=2233
bamboo_capability_system_jdk_JDK_10=/home/bamboo/jvms/jdk10
bamboo_carrot2_website_ssh=carrotse@mdd.carrot2.org:~/sites/project.carrot2.org
bamboo_csssprites_download_path=/srv/vhosts/get.csssprites.org
bamboo_carrotsearch_labs_ssh_port=2233
bamboo_carrot2_download_user=bamboo
JAVA_HOME=/home/bamboo/jvms/jdk7
bamboo_dependenciesDisabled=false
bamboo_capability_tools_dir=/home/bamboo/tools
bamboo_carrotsearch_download_staging_host=kappa.carrotsearch.com
bamboo_carrotsearch_download_official_path=~/sites/get.carrotsearch.com
bamboo_planRepository_branch=master
bamboo_carrotsearch_secure2_ssh=carrotse@get.carrotsearch.com:~/sites/secure.carrotsearch.com
bamboo_capability_system_jdk_JDK_11=/home/bamboo/jvms/jdk11
bamboo_planRepository_1_type=gitv2
bamboo_planRepository_branchName=master
bamboo_capability_system_jdk_JDK=/home/bamboo/jvms/jdk8
bamboo_repository_65537_git_username=
bamboo_hg_cache_directory=/var/atlassian/application-data/bamboo/xml-data/build-dir/_hg-repositories-cache
bamboo_planRepository_1_username=
bamboo_planRepository_type=gitv2
bamboo_ManualBuildTriggerReason_userName=dawid.weiss
bamboo_carrot2_download_host=kappa.carrotsearch.com
bamboo_git_cache_directory=/var/atlassian/application-data/bamboo/xml-data/build-dir/_git-repositories-cache
bamboo_carrotsearch_download_staging_user=bamboo
useMavenReturnCode=false
bamboo_capability_system_builder_node_Node_js=/usr/bin/nodejs
bamboo_capability_system_builder_ant_Ant=/home/bamboo/jvms/ant1.9
bamboo_capability_system_builder_mvn3_Maven_3=/home/bamboo/tools/apache-maven-3.5.2
bamboo_tmp_directory=/var/atlassian/application-data/bamboo/temp
bamboo_planKey=C2-BINDER
bamboo_planRepository_username=
bamboo_carrotsearch_website_ssh=carrotse@get.carrotsearch.com:~/sites/www.carrotsearch.com
bamboo_planRepository_1_branchName=master
bamboo_resultsUrl=https://builds.carrot2.org/browse/C2-BINDER-JDK17-28
bamboo_capability_Linux=
bamboo_carrotsearch_labs_ssh=carrotse@get.carrotsearch.com:~/sites/labs.carrotsearch.com
bamboo_build_working_directory=/var/atlassian/application-data/bamboo/xml-data/build-dir/C2-BINDER-JDK17
bamboo_planRepository_1_name=github/carrot2/attributes-binder
bamboo_shortPlanName=Attribute Binder
bamboo_planRepository_name=github/carrot2/attributes-binder
bamboo_repository_65537_git_branch=master
bamboo_buildNumber=28
bamboo_repository_65537_revision_number=9e303a94e5221db55e3fcb576e927fe08299eb96
bamboo_carrotsearch_secure_ssh_port=2233
bamboo_planName=Carrot2 - Attribute Binder
bamboo_capability_system_builder_command_git=git
bamboo_shortPlanKey=BINDER
bamboo_shortJobKey=JDK17
bamboo_buildTimeStamp=2018-05-10T13:05:43.095+02:00
bamboo_repository_previous_revision_number=a60025d54fd92503b71bd0213b79e534f1f41c7c
M2_HOME=/home/bamboo/tools/apache-maven-3.5.2
bamboo_repository_git_branch=master
bamboo_buildResultKey=C2-BINDER-JDK17-28
bamboo_buildPlanName=Carrot2 - Attribute Binder - JDK 1.7
bamboo_planRepository_1_revision=9e303a94e5221db55e3fcb576e927fe08299eb96
bamboo_repository_name=github/carrot2/attributes-binder
bamboo_carrot2_website_ssh_port=2233
bamboo_csssprites_download_host=kappa.carrotsearch.com
bamboo_repository_65537_previous_revision_number=a60025d54fd92503b71bd0213b79e534f1f41c7c
bamboo_buildFailed=false
bamboo_repository_65537_name=github/carrot2/attributes-binder
bamboo_repository_65537_git_repositoryUrl=https://github.com/carrot2/attributes-binder.git
bamboo_agentWorkingDirectory=/var/atlassian/application-data/bamboo/xml-data/build-dir
bamboo_carrotsearch_download_official_host=get.carrotsearch.com
bamboo_capability_system_git_executable=/usr/bin/git
bamboo_l4g_mvn_opts=-Xmx1g
bamboo_repository_git_username=
bamboo_planRepository_1_previousRevision=a60025d54fd92503b71bd0213b79e534f1f41c7c
bamboo_capability_system_jdk_JDK_1_8_IBM=/home/bamboo/jvms/jdk8-ibm
bamboo_carrotsearch_download_staging_path=/srv/vhosts/staging-get.carrotsearch.com
bamboo_planRepository_branchDisplayName=master
bamboo_capability_corpora_dir=/home/bamboo/corpora
bamboo_csssprites_download_user=bamboo
bamboo_plan_storageTag=C2-BINDER
bamboo_carrot2_download_path=/srv/vhosts/get.carrot2.org
bamboo_repository_git_repositoryUrl=https://github.com/carrot2/attributes-binder.git
bamboo_carrotsearch_download_official_user=carrotse
bamboo_working_directory=/var/atlassian/application-data/bamboo/xml-data/build-dir/C2-BINDER-JDK17
bamboo_planRepository_1_repositoryUrl=https://github.com/carrot2/attributes-binder.git
bamboo_capability_system_jdk_JDK_1_8=/home/bamboo/jvms/jdk8
bamboo_capability_system_builder_command_zip=zip
bamboo_capability_system_jdk_JDK_1_9=/home/bamboo/jvms/jdk9
bamboo_capability_system_jdk_JDK_1_7=/home/bamboo/jvms/jdk7
bamboo_carrotsearch_secure_ssh=carrotse@get.carrotsearch.com:~/sites/secure.carrotsearch.com
bamboo_carrotsearch_website_ssh_port=2233
PATH=/home/bamboo/jvms/jdk7/bin:/usr/local/bin:/usr/bin:/bin:/usr/local/games:/usr/games:/snap/bin
10-May-2018 13:05:44 [INFO] Scanning for projects...
10-May-2018 13:05:44 [WARNING] The project org.carrot2.attributes:attributes-parent:pom:1.3.3-SNAPSHOT uses prerequisites which is only intended for maven-plugin projects but not for non maven-plugin projects. For such purposes you should use the maven-enforcer-plugin. See https://maven.apache.org/enforcer/enforcer-rules/requireMavenVersion.html
10-May-2018 13:05:44 [INFO] ------------------------------------------------------------------------
10-May-2018 13:05:44 [INFO] Reactor Build Order:
10-May-2018 13:05:44 [INFO]
10-May-2018 13:05:44 [INFO] Attributes parent POM
10-May-2018 13:05:44 [INFO] Attributes binder runtime
10-May-2018 13:05:44 [INFO] Attributes metadata annotation processor
10-May-2018 13:05:44 [INFO] Attributes integration tests
10-May-2018 13:05:44 [INFO]
10-May-2018 13:05:44 [INFO] ------------------------------------------------------------------------
10-May-2018 13:05:44 [INFO] Building Attributes parent POM 1.3.3-SNAPSHOT
10-May-2018 13:05:44 [INFO] ------------------------------------------------------------------------
10-May-2018 13:05:49 [INFO] Downloading from central: https://repo.maven.apache.org/maven2/org/apache/maven/plugins/maven-enforcer-plugin/1.4.1/maven-enforcer-plugin-1.4.1.pom
10-May-2018 13:05:50 [INFO] Downloaded from central: https://repo.maven.apache.org/maven2/org/apache/maven/plugins/maven-enforcer-plugin/1.4.1/maven-enforcer-plugin-1.4.1.pom (7.3 kB at 18 kB/s)
10-May-2018 13:05:50 [INFO] Downloading from central: https://repo.maven.apache.org/maven2/org/apache/maven/enforcer/enforcer/1.4.1/enforcer-1.4.1.pom
10-May-2018 13:05:50 [INFO] Downloaded from central: https://repo.maven.apache.org/maven2/org/apache/maven/enforcer/enforcer/1.4.1/enforcer-1.4.1.pom (7.2 kB at 71 kB/s)
10-May-2018 13:05:50 [INFO] Downloading from central: https://repo.maven.apache.org/maven2/org/apache/maven/plugins/maven-enforcer-plugin/1.4.1/maven-enforcer-plugin-1.4.1.jar
10-May-2018 13:05:50 [INFO] Downloaded from central: https://repo.maven.apache.org/maven2/org/apache/maven/plugins/maven-enforcer-plugin/1.4.1/maven-enforcer-plugin-1.4.1.jar (27 kB at 177 kB/s)
10-May-2018 13:05:50 [INFO]
10-May-2018 13:05:50 [INFO] --- maven-clean-plugin:2.5:clean (default-clean) @ attributes-parent ---
10-May-2018 13:05:50 [INFO]
10-May-2018 13:05:50 [INFO] --- maven-enforcer-plugin:1.4.1:enforce (enforce-maven) @ attributes-parent ---
10-May-2018 13:05:50 [INFO] Downloading from central: https://repo.maven.apache.org/maven2/commons-lang/commons-lang/2.3/commons-lang-2.3.pom
10-May-2018 13:05:50 [INFO] Downloaded from central: https://repo.maven.apache.org/maven2/commons-lang/commons-lang/2.3/commons-lang-2.3.pom (11 kB at 109 kB/s)
10-May-2018 13:05:50 [INFO] Downloading from central: https://repo.maven.apache.org/maven2/org/apache/maven/enforcer/enforcer-api/1.4.1/enforcer-api-1.4.1.pom
10-May-2018 13:05:51 [INFO] Downloaded from central: https://repo.maven.apache.org/maven2/org/apache/maven/enforcer/enforcer-api/1.4.1/enforcer-api-1.4.1.pom (2.8 kB at 28 kB/s)
10-May-2018 13:05:51 [INFO] Downloading from central: https://repo.maven.apache.org/maven2/org/apache/maven/enforcer/enforcer-rules/1.4.1/enforcer-rules-1.4.1.pom
10-May-2018 13:05:51 [INFO] Downloaded from central: https://repo.maven.apache.org/maven2/org/apache/maven/enforcer/enforcer-rules/1.4.1/enforcer-rules-1.4.1.pom (3.7 kB at 38 kB/s)
10-May-2018 13:05:51 [INFO] Downloading from central: https://repo.maven.apache.org/maven2/org/codehaus/plexus/plexus-i18n/1.0-beta-6/plexus-i18n-1.0-beta-6.pom
10-May-2018 13:05:51 [INFO] Downloaded from central: https://repo.maven.apache.org/maven2/org/codehaus/plexus/plexus-i18n/1.0-beta-6/plexus-i18n-1.0-beta-6.pom (771 B at 7.9 kB/s)
10-May-2018 13:05:51 [INFO] Downloading from central: https://repo.maven.apache.org/maven2/org/codehaus/plexus/plexus-components/1.1.4/plexus-components-1.1.4.pom
10-May-2018 13:05:51 [INFO] Downloaded from central: https://repo.maven.apache.org/maven2/org/codehaus/plexus/plexus-components/1.1.4/plexus-components-1.1.4.pom (2.1 kB at 21 kB/s)
10-May-2018 13:05:51 [INFO] Downloading from central: https://repo.maven.apache.org/maven2/org/apache/maven/plugin-testing/maven-plugin-testing-harness/1.3/maven-plugin-testing-harness-1.3.pom
10-May-2018 13:05:51 [INFO] Downloaded from central: https://repo.maven.apache.org/maven2/org/apache/maven/plugin-testing/maven-plugin-testing-harness/1.3/maven-plugin-testing-harness-1.3.pom (3.4 kB at 36 kB/s)
10-May-2018 13:05:51 [INFO] Downloading from central: https://repo.maven.apache.org/maven2/org/apache/maven/plugin-testing/maven-plugin-testing/1.3/maven-plugin-testing-1.3.pom
10-May-2018 13:05:51 [INFO] Downloaded from central: https://repo.maven.apache.org/maven2/org/apache/maven/plugin-testing/maven-plugin-testing/1.3/maven-plugin-testing-1.3.pom (9.5 kB at 96 kB/s)
10-May-2018 13:05:51 [INFO] Downloading from central: https://repo.maven.apache.org/maven2/org/codehaus/plexus/plexus-archiver/2.2/plexus-archiver-2.2.pom
10-May-2018 13:05:51 [INFO] Downloaded from central: https://repo.maven.apache.org/maven2/org/codehaus/plexus/plexus-archiver/2.2/plexus-archiver-2.2.pom (3.2 kB at 32 kB/s)
10-May-2018 13:05:51 [INFO] Downloading from central: https://repo.maven.apache.org/maven2/org/codehaus/plexus/plexus-components/1.1.20/plexus-components-1.1.20.pom
10-May-2018 13:05:51 [INFO] Downloaded from central: https://repo.maven.apache.org/maven2/org/codehaus/plexus/plexus-components/1.1.20/plexus-components-1.1.20.pom (3.0 kB at 31 kB/s)
10-May-2018 13:05:51 [INFO] Downloading from central: https://repo.maven.apache.org/maven2/org/codehaus/plexus/plexus/3.1/plexus-3.1.pom
10-May-2018 13:05:51 [INFO] Downloaded from central: https://repo.maven.apache.org/maven2/org/codehaus/plexus/plexus/3.1/plexus-3.1.pom (19 kB at 179 kB/s)
10-May-2018 13:05:51 [INFO] Downloading from central: https://repo.maven.apache.org/maven2/org/codehaus/plexus/plexus-io/2.0.4/plexus-io-2.0.4.pom
10-May-2018 13:05:52 [INFO] Downloaded from central: https://repo.maven.apache.org/maven2/org/codehaus/plexus/plexus-io/2.0.4/plexus-io-2.0.4.pom (1.7 kB at 17 kB/s)
10-May-2018 13:05:52 [INFO] Downloading from central: https://repo.maven.apache.org/maven2/org/apache/maven/reporting/maven-reporting-api/2.2.1/maven-reporting-api-2.2.1.jar
10-May-2018 13:05:52 [INFO] Downloading from central: https://repo.maven.apache.org/maven2/org/apache/maven/doxia/doxia-sink-api/1.1/doxia-sink-api-1.1.jar
10-May-2018 13:05:52 [INFO] Downloading from central: https://repo.maven.apache.org/maven2/commons-lang/commons-lang/2.3/commons-lang-2.3.jar
10-May-2018 13:05:52 [INFO] Downloading from central: https://repo.maven.apache.org/maven2/org/apache/maven/enforcer/enforcer-api/1.4.1/enforcer-api-1.4.1.jar
10-May-2018 13:05:52 [INFO] Downloading from central: https://repo.maven.apache.org/maven2/org/apache/maven/enforcer/enforcer-rules/1.4.1/enforcer-rules-1.4.1.jar
10-May-2018 13:05:52 [INFO] Downloaded from central: https://repo.maven.apache.org/maven2/org/apache/maven/reporting/maven-reporting-api/2.2.1/maven-reporting-api-2.2.1.jar (9.8 kB at 91 kB/s)
10-May-2018 13:05:52 [INFO] Downloading from central: https://repo.maven.apache.org/maven2/org/codehaus/plexus/plexus-i18n/1.0-beta-6/plexus-i18n-1.0-beta-6.jar
10-May-2018 13:05:52 [INFO] Downloaded from central: https://repo.maven.apache.org/maven2/org/apache/maven/enforcer/enforcer-api/1.4.1/enforcer-api-1.4.1.jar (11 kB at 58 kB/s)
10-May-2018 13:05:52 [INFO] Downloading from central: https://repo.maven.apache.org/maven2/org/apache/maven/plugin-testing/maven-plugin-testing-harness/1.3/maven-plugin-testing-harness-1.3.jar
10-May-2018 13:05:52 [INFO] Downloaded from central: https://repo.maven.apache.org/maven2/org/apache/maven/doxia/doxia-sink-api/1.1/doxia-sink-api-1.1.jar (13 kB at 64 kB/s)
10-May-2018 13:05:52 [INFO] Downloading from central: https://repo.maven.apache.org/maven2/org/codehaus/plexus/plexus-archiver/2.2/plexus-archiver-2.2.jar
10-May-2018 13:05:52 [INFO] Downloaded from central: https://repo.maven.apache.org/maven2/org/codehaus/plexus/plexus-i18n/1.0-beta-6/plexus-i18n-1.0-beta-6.jar (12 kB at 58 kB/s)
10-May-2018 13:05:52 [INFO] Downloading from central: https://repo.maven.apache.org/maven2/org/codehaus/plexus/plexus-io/2.0.4/plexus-io-2.0.4.jar
10-May-2018 13:05:52 [INFO] Downloaded from central: https://repo.maven.apache.org/maven2/org/apache/maven/enforcer/enforcer-rules/1.4.1/enforcer-rules-1.4.1.jar (99 kB at 310 kB/s)
10-May-2018 13:05:52 [INFO] Downloaded from central: https://repo.maven.apache.org/maven2/org/apache/maven/plugin-testing/maven-plugin-testing-harness/1.3/maven-plugin-testing-harness-1.3.jar (35 kB at 104 kB/s)
10-May-2018 13:05:52 [INFO] Downloaded from central: https://repo.maven.apache.org/maven2/org/codehaus/plexus/plexus-io/2.0.4/plexus-io-2.0.4.jar (58 kB at 163 kB/s)
10-May-2018 13:05:52 [INFO] Downloaded from central: https://repo.maven.apache.org/maven2/commons-lang/commons-lang/2.3/commons-lang-2.3.jar (245 kB at 603 kB/s)
10-May-2018 13:05:52 [INFO] Downloaded from central: https://repo.maven.apache.org/maven2/org/codehaus/plexus/plexus-archiver/2.2/plexus-archiver-2.2.jar (185 kB at 437 kB/s)
10-May-2018 13:05:52 [INFO]
10-May-2018 13:05:52 [INFO] --- maven-enforcer-plugin:1.4.1:enforce (enforce-environment) @ attributes-parent ---
10-May-2018 13:05:52 [INFO]
10-May-2018 13:05:52 [INFO] ------------------------------------------------------------------------
10-May-2018 13:05:52 [INFO] Building Attributes binder runtime 1.3.3-SNAPSHOT
10-May-2018 13:05:52 [INFO] ------------------------------------------------------------------------
10-May-2018 13:05:52 [INFO] Downloading from central: https://repo.maven.apache.org/maven2/org/apache/maven/plugins/maven-compiler-plugin/3.3/maven-compiler-plugin-3.3.pom
10-May-2018 13:05:52 [INFO] Downloaded from central: https://repo.maven.apache.org/maven2/org/apache/maven/plugins/maven-compiler-plugin/3.3/maven-compiler-plugin-3.3.pom (11 kB at 109 kB/s)
10-May-2018 13:05:52 [INFO] Downloading from central: https://repo.maven.apache.org/maven2/org/apache/maven/plugins/maven-compiler-plugin/3.3/maven-compiler-plugin-3.3.jar
10-May-2018 13:05:52 [INFO] Downloaded from central: https://repo.maven.apache.org/maven2/org/apache/maven/plugins/maven-compiler-plugin/3.3/maven-compiler-plugin-3.3.jar (46 kB at 393 kB/s)
10-May-2018 13:05:52 [INFO] Downloading from central: https://repo.maven.apache.org/maven2/org/apache/maven/plugins/maven-surefire-plugin/2.12.4/maven-surefire-plugin-2.12.4.pom
10-May-2018 13:05:52 [INFO] Downloaded from central: https://repo.maven.apache.org/maven2/org/apache/maven/plugins/maven-surefire-plugin/2.12.4/maven-surefire-plugin-2.12.4.pom (10 kB at 105 kB/s)
10-May-2018 13:05:52 [INFO] Downloading from central: https://repo.maven.apache.org/maven2/org/apache/maven/surefire/surefire/2.12.4/surefire-2.12.4.pom
10-May-2018 13:05:53 [INFO] Downloaded from central: https://repo.maven.apache.org/maven2/org/apache/maven/surefire/surefire/2.12.4/surefire-2.12.4.pom (14 kB at 137 kB/s)
10-May-2018 13:05:53 [INFO] Downloading from central: https://repo.maven.apache.org/maven2/org/apache/maven/plugins/maven-surefire-plugin/2.12.4/maven-surefire-plugin-2.12.4.jar
10-May-2018 13:05:53 [INFO] Downloaded from central: https://repo.maven.apache.org/maven2/org/apache/maven/plugins/maven-surefire-plugin/2.12.4/maven-surefire-plugin-2.12.4.jar (30 kB at 282 kB/s)
10-May-2018 13:05:53 [INFO] Downloading from sonatype-nexus-public: https://oss.sonatype.org/content/groups/public/org/simpleframework/simple-xml/2.7/simple-xml-2.7.pom
10-May-2018 13:05:53 [INFO] Downloaded from sonatype-nexus-public: https://oss.sonatype.org/content/groups/public/org/simpleframework/simple-xml/2.7/simple-xml-2.7.pom (4.6 kB at 6.3 kB/s)
10-May-2018 13:05:53 [INFO] Downloading from sonatype-nexus-public: https://oss.sonatype.org/content/groups/public/org/carrot2/shaded/carrot2-guava/18.0/carrot2-guava-18.0.pom
10-May-2018 13:05:54 [INFO] Downloaded from sonatype-nexus-public: https://oss.sonatype.org/content/groups/public/org/carrot2/shaded/carrot2-guava/18.0/carrot2-guava-18.0.pom (5.3 kB at 17 kB/s)
10-May-2018 13:05:54 [INFO] Downloading from sonatype-nexus-public: https://oss.sonatype.org/content/groups/public/org/simpleframework/simple-xml/2.7/simple-xml-2.7.jar
10-May-2018 13:05:54 [INFO] Downloading from sonatype-nexus-public: https://oss.sonatype.org/content/groups/public/org/carrot2/shaded/carrot2-guava/18.0/carrot2-guava-18.0.jar
10-May-2018 13:05:55 [INFO] Downloaded from sonatype-nexus-public: https://oss.sonatype.org/content/groups/public/org/simpleframework/simple-xml/2.7/simple-xml-2.7.jar (413 kB at 522 kB/s)
10-May-2018 13:05:55 [INFO] Downloaded from sonatype-nexus-public: https://oss.sonatype.org/content/groups/public/org/carrot2/shaded/carrot2-guava/18.0/carrot2-guava-18.0.jar (2.3 MB at 1.6 MB/s)
10-May-2018 13:05:55 [INFO]
10-May-2018 13:05:55 [INFO] --- maven-clean-plugin:2.5:clean (default-clean) @ attributes-binder ---
10-May-2018 13:05:55 [INFO]
10-May-2018 13:05:55 [INFO] --- maven-resources-plugin:2.6:resources (default-resources) @ attributes-binder ---
10-May-2018 13:05:55 [INFO] Using 'UTF-8' encoding to copy filtered resources.
10-May-2018 13:05:55 [INFO] skip non existing resourceDirectory /var/atlassian/application-data/bamboo/xml-data/build-dir/C2-BINDER-JDK17/attributes-binder/src/main/resources
10-May-2018 13:05:55 [INFO]
10-May-2018 13:05:55 [INFO] --- maven-compiler-plugin:3.3:compile (default-compile) @ attributes-binder ---
10-May-2018 13:05:55 [INFO] Downloading from central: https://repo.maven.apache.org/maven2/org/apache/maven/shared/maven-shared-utils/0.7/maven-shared-utils-0.7.pom
10-May-2018 13:05:55 [INFO] Downloaded from central: https://repo.maven.apache.org/maven2/org/apache/maven/shared/maven-shared-utils/0.7/maven-shared-utils-0.7.pom (0 B at 0 B/s)
10-May-2018 13:05:55 [INFO] Downloading from central: https://repo.maven.apache.org/maven2/org/codehaus/plexus/plexus-compiler-api/2.5/plexus-compiler-api-2.5.pom
10-May-2018 13:05:55 [INFO] Downloaded from central: https://repo.maven.apache.org/maven2/org/codehaus/plexus/plexus-compiler-api/2.5/plexus-compiler-api-2.5.pom (865 B at 8.5 kB/s)
10-May-2018 13:05:55 [INFO] Downloading from central: https://repo.maven.apache.org/maven2/org/codehaus/plexus/plexus-compiler/2.5/plexus-compiler-2.5.pom
10-May-2018 13:05:56 [INFO] Downloaded from central: https://repo.maven.apache.org/maven2/org/codehaus/plexus/plexus-compiler/2.5/plexus-compiler-2.5.pom (5.3 kB at 51 kB/s)
10-May-2018 13:05:56 [INFO] Downloading from central: https://repo.maven.apache.org/maven2/org/codehaus/plexus/plexus-compiler-manager/2.5/plexus-compiler-manager-2.5.pom
10-May-2018 13:05:56 [INFO] Downloaded from central: https://repo.maven.apache.org/maven2/org/codehaus/plexus/plexus-compiler-manager/2.5/plexus-compiler-manager-2.5.pom (690 B at 6.6 kB/s)
10-May-2018 13:05:56 [INFO] Downloading from central: https://repo.maven.apache.org/maven2/org/codehaus/plexus/plexus-compiler-javac/2.5/plexus-compiler-javac-2.5.pom
10-May-2018 13:05:56 [INFO] Downloaded from central: https://repo.maven.apache.org/maven2/org/codehaus/plexus/plexus-compiler-javac/2.5/plexus-compiler-javac-2.5.pom (769 B at 7.2 kB/s)
10-May-2018 13:05:56 [INFO] Downloading from central: https://repo.maven.apache.org/maven2/org/codehaus/plexus/plexus-compilers/2.5/plexus-compilers-2.5.pom
10-May-2018 13:05:56 [INFO] Downloaded from central: https://repo.maven.apache.org/maven2/org/codehaus/plexus/plexus-compilers/2.5/plexus-compilers-2.5.pom (1.3 kB at 12 kB/s)
10-May-2018 13:05:56 [INFO] Downloading from central: https://repo.maven.apache.org/maven2/org/codehaus/plexus/plexus-compiler-api/2.5/plexus-compiler-api-2.5.jar
10-May-2018 13:05:56 [INFO] Downloading from central: https://repo.maven.apache.org/maven2/org/codehaus/plexus/plexus-compiler-manager/2.5/plexus-compiler-manager-2.5.jar
10-May-2018 13:05:56 [INFO] Downloading from central: https://repo.maven.apache.org/maven2/org/codehaus/plexus/plexus-compiler-javac/2.5/plexus-compiler-javac-2.5.jar
10-May-2018 13:05:56 [INFO] Downloaded from central: https://repo.maven.apache.org/maven2/org/codehaus/plexus/plexus-compiler-api/2.5/plexus-compiler-api-2.5.jar (25 kB at 197 kB/s)
10-May-2018 13:05:56 [INFO] Downloaded from central: https://repo.maven.apache.org/maven2/org/codehaus/plexus/plexus-compiler-manager/2.5/plexus-compiler-manager-2.5.jar (4.6 kB at 29 kB/s)
10-May-2018 13:05:56 [INFO] Downloaded from central: https://repo.maven.apache.org/maven2/org/codehaus/plexus/plexus-compiler-javac/2.5/plexus-compiler-javac-2.5.jar (19 kB at 112 kB/s)
10-May-2018 13:05:56 [INFO] Changes detected - recompiling the module!
10-May-2018 13:05:56 [INFO] Compiling 57 source files to /var/atlassian/application-data/bamboo/xml-data/build-dir/C2-BINDER-JDK17/attributes-binder/target/classes
10-May-2018 13:05:57 [INFO]
10-May-2018 13:05:57 [INFO] --- maven-resources-plugin:2.6:testResources (default-testResources) @ attributes-binder ---
10-May-2018 13:05:57 [INFO] Using 'UTF-8' encoding to copy filtered resources.
10-May-2018 13:05:57 [INFO] skip non existing resourceDirectory /var/atlassian/application-data/bamboo/xml-data/build-dir/C2-BINDER-JDK17/attributes-binder/src/test/resources
10-May-2018 13:05:57 [INFO]
10-May-2018 13:05:57 [INFO] --- maven-compiler-plugin:3.3:testCompile (default-testCompile) @ attributes-binder ---
10-May-2018 13:05:57 [INFO] No sources to compile
10-May-2018 13:05:57 [INFO]
10-May-2018 13:05:57 [INFO] --- maven-surefire-plugin:2.12.4:test (default-test) @ attributes-binder ---
10-May-2018 13:05:57 [INFO] Downloading from central: https://repo.maven.apache.org/maven2/org/apache/maven/surefire/surefire-booter/2.12.4/surefire-booter-2.12.4.pom
10-May-2018 13:05:57 [INFO] Downloaded from central: https://repo.maven.apache.org/maven2/org/apache/maven/surefire/surefire-booter/2.12.4/surefire-booter-2.12.4.pom (3.0 kB at 29 kB/s)
10-May-2018 13:05:57 [INFO] Downloading from central: https://repo.maven.apache.org/maven2/org/apache/maven/surefire/surefire-api/2.12.4/surefire-api-2.12.4.pom
10-May-2018 13:05:57 [INFO] Downloaded from central: https://repo.maven.apache.org/maven2/org/apache/maven/surefire/surefire-api/2.12.4/surefire-api-2.12.4.pom (2.5 kB at 20 kB/s)
10-May-2018 13:05:57 [INFO] Downloading from central: https://repo.maven.apache.org/maven2/org/apache/maven/surefire/maven-surefire-common/2.12.4/maven-surefire-common-2.12.4.pom
10-May-2018 13:05:57 [INFO] Downloaded from central: https://repo.maven.apache.org/maven2/org/apache/maven/surefire/maven-surefire-common/2.12.4/maven-surefire-common-2.12.4.pom (5.5 kB at 53 kB/s)
10-May-2018 13:05:57 [INFO] Downloading from central: https://repo.maven.apache.org/maven2/org/apache/maven/plugin-tools/maven-plugin-annotations/3.1/maven-plugin-annotations-3.1.pom
10-May-2018 13:05:57 [INFO] Downloaded from central: https://repo.maven.apache.org/maven2/org/apache/maven/plugin-tools/maven-plugin-annotations/3.1/maven-plugin-annotations-3.1.pom (1.6 kB at 14 kB/s)
10-May-2018 13:05:57 [INFO] Downloading from central: https://repo.maven.apache.org/maven2/org/apache/maven/plugin-tools/maven-plugin-tools/3.1/maven-plugin-tools-3.1.pom
10-May-2018 13:05:57 [INFO] Downloaded from central: https://repo.maven.apache.org/maven2/org/apache/maven/plugin-tools/maven-plugin-tools/3.1/maven-plugin-tools-3.1.pom (16 kB at 159 kB/s)
10-May-2018 13:05:57 [INFO] Downloading from central: https://repo.maven.apache.org/maven2/org/apache/maven/reporting/maven-reporting-api/2.0.9/maven-reporting-api-2.0.9.pom
10-May-2018 13:05:58 [INFO] Downloaded from central: https://repo.maven.apache.org/maven2/org/apache/maven/reporting/maven-reporting-api/2.0.9/maven-reporting-api-2.0.9.pom (1.8 kB at 17 kB/s)
10-May-2018 13:05:58 [INFO] Downloading from central: https://repo.maven.apache.org/maven2/org/apache/maven/reporting/maven-reporting/2.0.9/maven-reporting-2.0.9.pom
10-May-2018 13:05:58 [INFO] Downloaded from central: https://repo.maven.apache.org/maven2/org/apache/maven/reporting/maven-reporting/2.0.9/maven-reporting-2.0.9.pom (1.5 kB at 14 kB/s)
10-May-2018 13:05:58 [INFO] Downloading from central: https://repo.maven.apache.org/maven2/org/apache/maven/maven-toolchain/2.0.9/maven-toolchain-2.0.9.pom
10-May-2018 13:05:58 [INFO] Downloaded from central: https://repo.maven.apache.org/maven2/org/apache/maven/maven-toolchain/2.0.9/maven-toolchain-2.0.9.pom (3.5 kB at 32 kB/s)
10-May-2018 13:05:58 [INFO] Downloading from central: https://repo.maven.apache.org/maven2/org/apache/maven/surefire/surefire-booter/2.12.4/surefire-booter-2.12.4.jar
10-May-2018 13:05:58 [INFO] Downloading from central: https://repo.maven.apache.org/maven2/org/apache/maven/surefire/surefire-api/2.12.4/surefire-api-2.12.4.jar
10-May-2018 13:05:58 [INFO] Downloading from central: https://repo.maven.apache.org/maven2/org/apache/maven/surefire/maven-surefire-common/2.12.4/maven-surefire-common-2.12.4.jar
10-May-2018 13:05:58 [INFO] Downloading from central: https://repo.maven.apache.org/maven2/org/apache/maven/reporting/maven-reporting-api/2.0.9/maven-reporting-api-2.0.9.jar
10-May-2018 13:05:58 [INFO] Downloading from central: https://repo.maven.apache.org/maven2/org/apache/maven/maven-toolchain/2.0.9/maven-toolchain-2.0.9.jar
10-May-2018 13:05:58 [INFO] Downloaded from central: https://repo.maven.apache.org/maven2/org/apache/maven/reporting/maven-reporting-api/2.0.9/maven-reporting-api-2.0.9.jar (10 kB at 100 kB/s)
10-May-2018 13:05:58 [INFO] Downloading from central: https://repo.maven.apache.org/maven2/org/apache/maven/plugin-tools/maven-plugin-annotations/3.1/maven-plugin-annotations-3.1.jar
10-May-2018 13:05:58 [INFO] Downloaded from central: https://repo.maven.apache.org/maven2/org/apache/maven/surefire/surefire-booter/2.12.4/surefire-booter-2.12.4.jar (35 kB at 318 kB/s)
10-May-2018 13:05:58 [INFO] Downloaded from central: https://repo.maven.apache.org/maven2/org/apache/maven/maven-toolchain/2.0.9/maven-toolchain-2.0.9.jar (38 kB at 316 kB/s)
10-May-2018 13:05:58 [INFO] Downloaded from central: https://repo.maven.apache.org/maven2/org/apache/maven/surefire/surefire-api/2.12.4/surefire-api-2.12.4.jar (118 kB at 726 kB/s)
10-May-2018 13:05:58 [INFO] Downloaded from central: https://repo.maven.apache.org/maven2/org/apache/maven/plugin-tools/maven-plugin-annotations/3.1/maven-plugin-annotations-3.1.jar (14 kB at 68 kB/s)
10-May-2018 13:05:58 [INFO] Downloaded from central: https://repo.maven.apache.org/maven2/org/apache/maven/surefire/maven-surefire-common/2.12.4/maven-surefire-common-2.12.4.jar (263 kB at 1.2 MB/s)
10-May-2018 13:05:58 [INFO] No tests to run.
10-May-2018 13:05:58 [INFO]
10-May-2018 13:05:58 [INFO] --- maven-jar-plugin:2.4:jar (default-jar) @ attributes-binder ---
10-May-2018 13:05:58 [INFO] Building jar: /var/atlassian/application-data/bamboo/xml-data/build-dir/C2-BINDER-JDK17/attributes-binder/target/attributes-binder-1.3.3-SNAPSHOT.jar
10-May-2018 13:05:58 [INFO]
10-May-2018 13:05:58 [INFO] ------------------------------------------------------------------------
10-May-2018 13:05:58 [INFO] Building Attributes metadata annotation processor 1.3.3-SNAPSHOT
10-May-2018 13:05:58 [INFO] ------------------------------------------------------------------------
10-May-2018 13:05:58 [INFO] Downloading from apache-releases: https://repository.apache.org/content/repositories/releases/org/apache/maven/plugins/maven-shade-plugin/1.7/maven-shade-plugin-1.7.pom
10-May-2018 13:05:59 [INFO] Downloaded from apache-releases: https://repository.apache.org/content/repositories/releases/org/apache/maven/plugins/maven-shade-plugin/1.7/maven-shade-plugin-1.7.pom (5.8 kB at 5.4 kB/s)
10-May-2018 13:05:59 [INFO] Downloading from apache-releases: https://repository.apache.org/content/repositories/releases/org/apache/maven/plugins/maven-shade-plugin/1.7/maven-shade-plugin-1.7.jar
10-May-2018 13:06:00 [INFO] Downloaded from apache-releases: https://repository.apache.org/content/repositories/releases/org/apache/maven/plugins/maven-shade-plugin/1.7/maven-shade-plugin-1.7.jar (86 kB at 90 kB/s)
10-May-2018 13:06:00 [INFO] Downloading from sonatype-nexus-public: https://oss.sonatype.org/content/groups/public/org/apache/velocity/velocity-engine-core/2.0/velocity-engine-core-2.0.pom
10-May-2018 13:06:09 [INFO] Downloading from central: https://repo.maven.apache.org/maven2/org/apache/velocity/velocity-engine-core/2.0/velocity-engine-core-2.0.pom
10-May-2018 13:06:09 [INFO] Downloaded from central: https://repo.maven.apache.org/maven2/org/apache/velocity/velocity-engine-core/2.0/velocity-engine-core-2.0.pom (7.1 kB at 70 kB/s)
10-May-2018 13:06:09 [INFO] Downloading from sonatype-nexus-public: https://oss.sonatype.org/content/groups/public/org/apache/velocity/velocity-engine-parent/2.0/velocity-engine-parent-2.0.pom
10-May-2018 13:06:09 [INFO] Downloading from central: https://repo.maven.apache.org/maven2/org/apache/velocity/velocity-engine-parent/2.0/velocity-engine-parent-2.0.pom
10-May-2018 13:06:09 [INFO] Downloaded from central: https://repo.maven.apache.org/maven2/org/apache/velocity/velocity-engine-parent/2.0/velocity-engine-parent-2.0.pom (9.0 kB at 89 kB/s)
10-May-2018 13:06:09 [INFO] Downloading from sonatype-nexus-public: https://oss.sonatype.org/content/groups/public/org/apache/velocity/velocity-master/2/velocity-master-2.pom
10-May-2018 13:06:10 [INFO] Downloading from central: https://repo.maven.apache.org/maven2/org/apache/velocity/velocity-master/2/velocity-master-2.pom
10-May-2018 13:06:10 [INFO] Downloaded from central: https://repo.maven.apache.org/maven2/org/apache/velocity/velocity-master/2/velocity-master-2.pom (7.8 kB at 73 kB/s)
10-May-2018 13:06:10 [INFO] Downloading from sonatype-nexus-public: https://oss.sonatype.org/content/groups/public/org/slf4j/slf4j-api/1.7.25/slf4j-api-1.7.25.pom
10-May-2018 13:06:11 [INFO] Downloaded from sonatype-nexus-public: https://oss.sonatype.org/content/groups/public/org/slf4j/slf4j-api/1.7.25/slf4j-api-1.7.25.pom (3.8 kB at 5.1 kB/s)
10-May-2018 13:06:11 [INFO] Downloading from sonatype-nexus-public: https://oss.sonatype.org/content/groups/public/org/slf4j/slf4j-parent/1.7.25/slf4j-parent-1.7.25.pom
10-May-2018 13:06:11 [INFO] Downloaded from sonatype-nexus-public: https://oss.sonatype.org/content/groups/public/org/slf4j/slf4j-parent/1.7.25/slf4j-parent-1.7.25.pom (14 kB at 29 kB/s)
10-May-2018 13:06:11 [INFO] Downloading from sonatype-nexus-public: https://oss.sonatype.org/content/groups/public/org/apache/velocity/velocity-engine-core/2.0/velocity-engine-core-2.0.jar
10-May-2018 13:06:11 [INFO] Downloading from sonatype-nexus-public: https://oss.sonatype.org/content/groups/public/org/slf4j/slf4j-api/1.7.25/slf4j-api-1.7.25.jar
10-May-2018 13:06:12 [INFO] Downloaded from sonatype-nexus-public: https://oss.sonatype.org/content/groups/public/org/slf4j/slf4j-api/1.7.25/slf4j-api-1.7.25.jar (41 kB at 58 kB/s)
10-May-2018 13:06:12 [INFO] Downloading from central: https://repo.maven.apache.org/maven2/org/apache/velocity/velocity-engine-core/2.0/velocity-engine-core-2.0.jar
10-May-2018 13:06:12 [INFO] Downloaded from central: https://repo.maven.apache.org/maven2/org/apache/velocity/velocity-engine-core/2.0/velocity-engine-core-2.0.jar (432 kB at 1.6 MB/s)
10-May-2018 13:06:12 [INFO]
10-May-2018 13:06:12 [INFO] --- maven-clean-plugin:2.5:clean (default-clean) @ attributes-processor ---
10-May-2018 13:06:12 [INFO]
10-May-2018 13:06:12 [INFO] --- maven-resources-plugin:2.6:resources (default-resources) @ attributes-processor ---
10-May-2018 13:06:12 [INFO] Using 'UTF-8' encoding to copy filtered resources.
10-May-2018 13:06:12 [INFO] Copying 4 resources
10-May-2018 13:06:12 [INFO]
10-May-2018 13:06:12 [INFO] --- maven-compiler-plugin:3.3:compile (default-compile) @ attributes-processor ---
10-May-2018 13:06:12 [INFO] Changes detected - recompiling the module!
10-May-2018 13:06:12 [INFO] Compiling 12 source files to /var/atlassian/application-data/bamboo/xml-data/build-dir/C2-BINDER-JDK17/attributes-processor/target/classes
10-May-2018 13:06:13 [INFO] /var/atlassian/application-data/bamboo/xml-data/build-dir/C2-BINDER-JDK17/attributes-processor/src/main/java/org/carrot2/util/preprocessor/BuilderBase.java: /var/atlassian/application-data/bamboo/xml-data/build-dir/C2-BINDER-JDK17/attributes-processor/src/main/java/org/carrot2/util/preprocessor/BuilderBase.java uses or overrides a deprecated API.
10-May-2018 13:06:13 [INFO] /var/atlassian/application-data/bamboo/xml-data/build-dir/C2-BINDER-JDK17/attributes-processor/src/main/java/org/carrot2/util/preprocessor/BuilderBase.java: Recompile with -Xlint:deprecation for details.
10-May-2018 13:06:13 [INFO]
10-May-2018 13:06:13 [INFO] --- maven-resources-plugin:2.6:testResources (default-testResources) @ attributes-processor ---
10-May-2018 13:06:13 [INFO] Using 'UTF-8' encoding to copy filtered resources.
10-May-2018 13:06:13 [INFO] skip non existing resourceDirectory /var/atlassian/application-data/bamboo/xml-data/build-dir/C2-BINDER-JDK17/attributes-processor/src/test/resources
10-May-2018 13:06:13 [INFO]
10-May-2018 13:06:13 [INFO] --- maven-compiler-plugin:3.3:testCompile (default-testCompile) @ attributes-processor ---
10-May-2018 13:06:13 [INFO] No sources to compile
10-May-2018 13:06:13 [INFO]
10-May-2018 13:06:13 [INFO] --- maven-surefire-plugin:2.12.4:test (default-test) @ attributes-processor ---
10-May-2018 13:06:13 [INFO] No tests to run.
10-May-2018 13:06:13 [INFO]
10-May-2018 13:06:13 [INFO] --- maven-jar-plugin:2.4:jar (default-jar) @ attributes-processor ---
10-May-2018 13:06:13 [INFO] Building jar: /var/atlassian/application-data/bamboo/xml-data/build-dir/C2-BINDER-JDK17/attributes-processor/target/attributes-processor-1.3.3-SNAPSHOT.jar
10-May-2018 13:06:13 [INFO]
10-May-2018 13:06:13 [INFO] --- maven-shade-plugin:1.7:shade (default) @ attributes-processor ---
10-May-2018 13:06:13 [INFO] Downloading from apache-releases: https://repository.apache.org/content/repositories/releases/asm/asm/3.3.1/asm-3.3.1.pom
10-May-2018 13:06:13 [INFO] Downloading from central: https://repo.maven.apache.org/maven2/asm/asm/3.3.1/asm-3.3.1.pom
10-May-2018 13:06:13 [INFO] Downloaded from central: https://repo.maven.apache.org/maven2/asm/asm/3.3.1/asm-3.3.1.pom (266 B at 2.5 kB/s)
10-May-2018 13:06:13 [INFO] Downloading from apache-releases: https://repository.apache.org/content/repositories/releases/asm/asm-parent/3.3.1/asm-parent-3.3.1.pom
10-May-2018 13:06:13 [INFO] Downloading from central: https://repo.maven.apache.org/maven2/asm/asm-parent/3.3.1/asm-parent-3.3.1.pom
10-May-2018 13:06:14 [INFO] Downloaded from central: https://repo.maven.apache.org/maven2/asm/asm-parent/3.3.1/asm-parent-3.3.1.pom (4.3 kB at 43 kB/s)
10-May-2018 13:06:14 [INFO] Downloading from apache-releases: https://repository.apache.org/content/repositories/releases/asm/asm-commons/3.3.1/asm-commons-3.3.1.pom
10-May-2018 13:06:14 [INFO] Downloading from central: https://repo.maven.apache.org/maven2/asm/asm-commons/3.3.1/asm-commons-3.3.1.pom
10-May-2018 13:06:14 [INFO] Downloaded from central: https://repo.maven.apache.org/maven2/asm/asm-commons/3.3.1/asm-commons-3.3.1.pom (417 B at 4.1 kB/s)
10-May-2018 13:06:14 [INFO] Downloading from apache-releases: https://repository.apache.org/content/repositories/releases/asm/asm-tree/3.3.1/asm-tree-3.3.1.pom
10-May-2018 13:06:14 [INFO] Downloading from central: https://repo.maven.apache.org/maven2/asm/asm-tree/3.3.1/asm-tree-3.3.1.pom
10-May-2018 13:06:15 [INFO] Downloaded from central: https://repo.maven.apache.org/maven2/asm/asm-tree/3.3.1/asm-tree-3.3.1.pom (406 B at 4.1 kB/s)
10-May-2018 13:06:15 [INFO] Downloading from apache-releases: https://repository.apache.org/content/repositories/releases/org/apache/maven/shared/maven-dependency-tree/1.1/maven-dependency-tree-1.1.pom
10-May-2018 13:06:15 [INFO] Downloaded from apache-releases: https://repository.apache.org/content/repositories/releases/org/apache/maven/shared/maven-dependency-tree/1.1/maven-dependency-tree-1.1.pom (2.9 kB at 4.0 kB/s)
10-May-2018 13:06:15 [INFO] Downloading from apache-releases: https://repository.apache.org/content/repositories/releases/org/vafer/jdependency/0.7/jdependency-0.7.pom
10-May-2018 13:06:16 [INFO] Downloading from central: https://repo.maven.apache.org/maven2/org/vafer/jdependency/0.7/jdependency-0.7.pom
10-May-2018 13:06:16 [INFO] Downloaded from central: https://repo.maven.apache.org/maven2/org/vafer/jdependency/0.7/jdependency-0.7.pom (7.5 kB at 72 kB/s)
10-May-2018 13:06:16 [INFO] Downloading from apache-releases: https://repository.apache.org/content/repositories/releases/commons-io/commons-io/1.3.2/commons-io-1.3.2.pom
10-May-2018 13:06:16 [INFO] Downloaded from apache-releases: https://repository.apache.org/content/repositories/releases/commons-io/commons-io/1.3.2/commons-io-1.3.2.pom (9.7 kB at 13 kB/s)
10-May-2018 13:06:16 [INFO] Downloading from apache-releases: https://repository.apache.org/content/repositories/releases/org/apache/commons/commons-parent/3/commons-parent-3.pom
10-May-2018 13:06:17 [INFO] Downloaded from apache-releases: https://repository.apache.org/content/repositories/releases/org/apache/commons/commons-parent/3/commons-parent-3.pom (12 kB at 16 kB/s)
10-May-2018 13:06:17 [INFO] Downloading from apache-releases: https://repository.apache.org/content/repositories/releases/asm/asm/3.2/asm-3.2.pom
10-May-2018 13:06:18 [INFO] Downloading from central: https://repo.maven.apache.org/maven2/asm/asm/3.2/asm-3.2.pom
10-May-2018 13:06:18 [INFO] Downloaded from central: https://repo.maven.apache.org/maven2/asm/asm/3.2/asm-3.2.pom (264 B at 2.6 kB/s)
10-May-2018 13:06:18 [INFO] Downloading from apache-releases: https://repository.apache.org/content/repositories/releases/asm/asm-parent/3.2/asm-parent-3.2.pom
10-May-2018 13:06:18 [INFO] Downloading from central: https://repo.maven.apache.org/maven2/asm/asm-parent/3.2/asm-parent-3.2.pom
10-May-2018 13:06:18 [INFO] Downloaded from central: https://repo.maven.apache.org/maven2/asm/asm-parent/3.2/asm-parent-3.2.pom (4.4 kB at 43 kB/s)
10-May-2018 13:06:18 [INFO] Downloading from apache-releases: https://repository.apache.org/content/repositories/releases/asm/asm-analysis/3.2/asm-analysis-3.2.pom
10-May-2018 13:06:18 [INFO] Downloading from central: https://repo.maven.apache.org/maven2/asm/asm-analysis/3.2/asm-analysis-3.2.pom
10-May-2018 13:06:19 [INFO] Downloaded from central: https://repo.maven.apache.org/maven2/asm/asm-analysis/3.2/asm-analysis-3.2.pom (417 B at 4.2 kB/s)
10-May-2018 13:06:19 [INFO] Downloading from apache-releases: https://repository.apache.org/content/repositories/releases/asm/asm-tree/3.2/asm-tree-3.2.pom
10-May-2018 13:06:19 [INFO] Downloading from central: https://repo.maven.apache.org/maven2/asm/asm-tree/3.2/asm-tree-3.2.pom
10-May-2018 13:06:19 [INFO] Downloaded from central: https://repo.maven.apache.org/maven2/asm/asm-tree/3.2/asm-tree-3.2.pom (404 B at 4.0 kB/s)
10-May-2018 13:06:19 [INFO] Downloading from apache-releases: https://repository.apache.org/content/repositories/releases/asm/asm-commons/3.2/asm-commons-3.2.pom
10-May-2018 13:06:19 [INFO] Downloading from central: https://repo.maven.apache.org/maven2/asm/asm-commons/3.2/asm-commons-3.2.pom
10-May-2018 13:06:19 [INFO] Downloaded from central: https://repo.maven.apache.org/maven2/asm/asm-commons/3.2/asm-commons-3.2.pom (415 B at 4.0 kB/s)
10-May-2018 13:06:20 [INFO] Downloading from apache-releases: https://repository.apache.org/content/repositories/releases/asm/asm-util/3.2/asm-util-3.2.pom
10-May-2018 13:06:20 [INFO] Downloading from central: https://repo.maven.apache.org/maven2/asm/asm-util/3.2/asm-util-3.2.pom
10-May-2018 13:06:20 [INFO] Downloaded from central: https://repo.maven.apache.org/maven2/asm/asm-util/3.2/asm-util-3.2.pom (409 B at 4.1 kB/s)
10-May-2018 13:06:20 [INFO] Downloading from apache-releases: https://repository.apache.org/content/repositories/releases/org/codehaus/plexus/plexus-utils/1.5.5/plexus-utils-1.5.5.jar
10-May-2018 13:06:20 [INFO] Downloading from apache-releases: https://repository.apache.org/content/repositories/releases/asm/asm/3.3.1/asm-3.3.1.jar
10-May-2018 13:06:20 [INFO] Downloading from apache-releases: https://repository.apache.org/content/repositories/releases/asm/asm-commons/3.3.1/asm-commons-3.3.1.jar
10-May-2018 13:06:20 [INFO] Downloading from apache-releases: https://repository.apache.org/content/repositories/releases/asm/asm-tree/3.3.1/asm-tree-3.3.1.jar
10-May-2018 13:06:20 [INFO] Downloading from apache-releases: https://repository.apache.org/content/repositories/releases/org/apache/maven/shared/maven-dependency-tree/1.1/maven-dependency-tree-1.1.jar
10-May-2018 13:06:20 [INFO] Downloading from apache-releases: https://repository.apache.org/content/repositories/releases/org/vafer/jdependency/0.7/jdependency-0.7.jar
10-May-2018 13:06:20 [INFO] Downloading from apache-releases: https://repository.apache.org/content/repositories/releases/commons-io/commons-io/1.3.2/commons-io-1.3.2.jar
10-May-2018 13:06:20 [INFO] Downloading from apache-releases: https://repository.apache.org/content/repositories/releases/asm/asm-analysis/3.2/asm-analysis-3.2.jar
10-May-2018 13:06:20 [INFO] Downloading from apache-releases: https://repository.apache.org/content/repositories/releases/asm/asm-util/3.2/asm-util-3.2.jar
10-May-2018 13:06:21 [INFO] Downloaded from apache-releases: https://repository.apache.org/content/repositories/releases/org/apache/maven/shared/maven-dependency-tree/1.1/maven-dependency-tree-1.1.jar (34 kB at 40 kB/s)
10-May-2018 13:06:21 [INFO] Downloaded from apache-releases: https://repository.apache.org/content/repositories/releases/commons-io/commons-io/1.3.2/commons-io-1.3.2.jar (88 kB at 67 kB/s)
10-May-2018 13:06:21 [INFO] Downloading from central: https://repo.maven.apache.org/maven2/org/codehaus/plexus/plexus-utils/1.5.5/plexus-utils-1.5.5.jar
10-May-2018 13:06:21 [INFO] Downloading from central: https://repo.maven.apache.org/maven2/asm/asm/3.3.1/asm-3.3.1.jar
10-May-2018 13:06:21 [INFO] Downloading from central: https://repo.maven.apache.org/maven2/asm/asm-commons/3.3.1/asm-commons-3.3.1.jar
10-May-2018 13:06:21 [INFO] Downloading from central: https://repo.maven.apache.org/maven2/asm/asm-tree/3.3.1/asm-tree-3.3.1.jar
10-May-2018 13:06:21 [INFO] Downloading from central: https://repo.maven.apache.org/maven2/org/vafer/jdependency/0.7/jdependency-0.7.jar
10-May-2018 13:06:21 [INFO] Downloaded from central: https://repo.maven.apache.org/maven2/org/vafer/jdependency/0.7/jdependency-0.7.jar (12 kB at 110 kB/s)
10-May-2018 13:06:21 [INFO] Downloading from central: https://repo.maven.apache.org/maven2/asm/asm-analysis/3.2/asm-analysis-3.2.jar
10-May-2018 13:06:21 [INFO] Downloaded from central: https://repo.maven.apache.org/maven2/asm/asm-commons/3.3.1/asm-commons-3.3.1.jar (38 kB at 355 kB/s)
10-May-2018 13:06:21 [INFO] Downloading from central: https://repo.maven.apache.org/maven2/asm/asm-util/3.2/asm-util-3.2.jar
10-May-2018 13:06:21 [INFO] Downloaded from central: https://repo.maven.apache.org/maven2/asm/asm-tree/3.3.1/asm-tree-3.3.1.jar (22 kB at 194 kB/s)
10-May-2018 13:06:21 [INFO] Downloaded from central: https://repo.maven.apache.org/maven2/asm/asm/3.3.1/asm-3.3.1.jar (44 kB at 372 kB/s)
10-May-2018 13:06:21 [INFO] Downloaded from central: https://repo.maven.apache.org/maven2/org/codehaus/plexus/plexus-utils/1.5.5/plexus-utils-1.5.5.jar (251 kB at 1.2 MB/s)
10-May-2018 13:06:22 [INFO] Downloaded from central: https://repo.maven.apache.org/maven2/asm/asm-analysis/3.2/asm-analysis-3.2.jar (18 kB at 84 kB/s)
10-May-2018 13:06:22 [INFO] Downloaded from central: https://repo.maven.apache.org/maven2/asm/asm-util/3.2/asm-util-3.2.jar (37 kB at 168 kB/s)
10-May-2018 13:06:22 [INFO] Including org.carrot2.attributes:attributes-binder:jar:1.3.3-SNAPSHOT in the shaded jar.
10-May-2018 13:06:22 [INFO] Including com.thoughtworks.qdox:qdox:jar:1.12.1 in the shaded jar.
10-May-2018 13:06:22 [INFO] Including org.apache.velocity:velocity-engine-core:jar:2.0 in the shaded jar.
10-May-2018 13:06:22 [INFO] Including org.apache.commons:commons-lang3:jar:3.5 in the shaded jar.
10-May-2018 13:06:22 [INFO] Excluding org.slf4j:slf4j-api:jar:1.7.25 from the shaded jar.
10-May-2018 13:06:22 [INFO] No artifact matching filter org.apache.velocity:velocity
10-May-2018 13:06:22 [INFO] Replacing original artifact with shaded artifact.
10-May-2018 13:06:22 [INFO] Replacing /var/atlassian/application-data/bamboo/xml-data/build-dir/C2-BINDER-JDK17/attributes-processor/target/attributes-processor-1.3.3-SNAPSHOT.jar with /var/atlassian/application-data/bamboo/xml-data/build-dir/C2-BINDER-JDK17/attributes-processor/target/attributes-processor-1.3.3-SNAPSHOT-shaded.jar
10-May-2018 13:06:22 [INFO]
10-May-2018 13:06:22 [INFO] ------------------------------------------------------------------------
10-May-2018 13:06:22 [INFO] Building Attributes integration tests 1.3.3-SNAPSHOT
10-May-2018 13:06:22 [INFO] ------------------------------------------------------------------------
10-May-2018 13:06:22 [INFO] Downloading from central: https://repo.maven.apache.org/maven2/org/codehaus/mojo/build-helper-maven-plugin/1.8/build-helper-maven-plugin-1.8.pom
10-May-2018 13:06:22 [INFO] Downloaded from central: https://repo.maven.apache.org/maven2/org/codehaus/mojo/build-helper-maven-plugin/1.8/build-helper-maven-plugin-1.8.pom (6.7 kB at 68 kB/s)
10-May-2018 13:06:22 [INFO] Downloading from central: https://repo.maven.apache.org/maven2/org/codehaus/mojo/mojo-parent/30/mojo-parent-30.pom
10-May-2018 13:06:22 [INFO] Downloaded from central: https://repo.maven.apache.org/maven2/org/codehaus/mojo/mojo-parent/30/mojo-parent-30.pom (27 kB at 256 kB/s)
10-May-2018 13:06:22 [INFO] Downloading from central: https://repo.maven.apache.org/maven2/org/codehaus/mojo/build-helper-maven-plugin/1.8/build-helper-maven-plugin-1.8.jar
10-May-2018 13:06:23 [INFO] Downloaded from central: https://repo.maven.apache.org/maven2/org/codehaus/mojo/build-helper-maven-plugin/1.8/build-helper-maven-plugin-1.8.jar (42 kB at 398 kB/s)
10-May-2018 13:06:23 [INFO] Downloading from central: https://repo.maven.apache.org/maven2/org/bsc/maven/maven-processor-plugin/2.2.0/maven-processor-plugin-2.2.0.pom
10-May-2018 13:06:23 [INFO] Downloaded from central: https://repo.maven.apache.org/maven2/org/bsc/maven/maven-processor-plugin/2.2.0/maven-processor-plugin-2.2.0.pom (11 kB at 30 kB/s)
10-May-2018 13:06:23 [INFO] Downloading from central: https://repo.maven.apache.org/maven2/org/bsc/maven/maven-processor-plugin/2.2.0/maven-processor-plugin-2.2.0.jar
10-May-2018 13:06:23 [INFO] Downloaded from central: https://repo.maven.apache.org/maven2/org/bsc/maven/maven-processor-plugin/2.2.0/maven-processor-plugin-2.2.0.jar (32 kB at 68 kB/s)
10-May-2018 13:06:23 [INFO] Downloading from central: https://repo.maven.apache.org/maven2/org/apache/maven/plugins/maven-surefire-plugin/2.12/maven-surefire-plugin-2.12.pom
10-May-2018 13:06:24 [INFO] Downloaded from central: https://repo.maven.apache.org/maven2/org/apache/maven/plugins/maven-surefire-plugin/2.12/maven-surefire-plugin-2.12.pom (10 kB at 100 kB/s)
10-May-2018 13:06:24 [INFO] Downloading from central: https://repo.maven.apache.org/maven2/org/apache/maven/surefire/surefire/2.12/surefire-2.12.pom
10-May-2018 13:06:24 [INFO] Downloaded from central: https://repo.maven.apache.org/maven2/org/apache/maven/surefire/surefire/2.12/surefire-2.12.pom (11 kB at 105 kB/s)
10-May-2018 13:06:24 [INFO] Downloading from central: https://repo.maven.apache.org/maven2/org/apache/maven/plugins/maven-surefire-plugin/2.12/maven-surefire-plugin-2.12.jar
10-May-2018 13:06:24 [INFO] Downloaded from central: https://repo.maven.apache.org/maven2/org/apache/maven/plugins/maven-surefire-plugin/2.12/maven-surefire-plugin-2.12.jar (31 kB at 297 kB/s)
10-May-2018 13:06:24 [INFO] Downloading from central: https://repo.maven.apache.org/maven2/com/carrotsearch/randomizedtesting/junit4-maven-plugin/2.6.1/junit4-maven-plugin-2.6.1.pom
10-May-2018 13:06:24 [INFO] Downloaded from central: https://repo.maven.apache.org/maven2/com/carrotsearch/randomizedtesting/junit4-maven-plugin/2.6.1/junit4-maven-plugin-2.6.1.pom (4.2 kB at 9.7 kB/s)
10-May-2018 13:06:24 [INFO] Downloading from central: https://repo.maven.apache.org/maven2/com/carrotsearch/randomizedtesting/randomizedtesting-parent/2.6.1/randomizedtesting-parent-2.6.1.pom
10-May-2018 13:06:25 [INFO] Downloaded from central: https://repo.maven.apache.org/maven2/com/carrotsearch/randomizedtesting/randomizedtesting-parent/2.6.1/randomizedtesting-parent-2.6.1.pom (24 kB at 73 kB/s)
10-May-2018 13:06:25 [INFO] Downloading from central: https://repo.maven.apache.org/maven2/com/carrotsearch/randomizedtesting/junit4-maven-plugin/2.6.1/junit4-maven-plugin-2.6.1.jar
10-May-2018 13:06:25 [INFO] Downloaded from central: https://repo.maven.apache.org/maven2/com/carrotsearch/randomizedtesting/junit4-maven-plugin/2.6.1/junit4-maven-plugin-2.6.1.jar (30 kB at 91 kB/s)
10-May-2018 13:06:25 [INFO] Downloading from sonatype-nexus-public: https://oss.sonatype.org/content/groups/public/org/easytesting/fest-assert/1.4/fest-assert-1.4.pom
10-May-2018 13:06:29 [INFO] Downloaded from sonatype-nexus-public: https://oss.sonatype.org/content/groups/public/org/easytesting/fest-assert/1.4/fest-assert-1.4.pom (2.4 kB at 596 B/s)
10-May-2018 13:06:29 [INFO] Downloading from sonatype-nexus-public: https://oss.sonatype.org/content/groups/public/org/easytesting/fest/1.0.8/fest-1.0.8.pom
10-May-2018 13:06:30 [INFO] Downloaded from sonatype-nexus-public: https://oss.sonatype.org/content/groups/public/org/easytesting/fest/1.0.8/fest-1.0.8.pom (12 kB at 18 kB/s)
10-May-2018 13:06:30 [INFO] Downloading from sonatype-nexus-public: https://oss.sonatype.org/content/groups/public/org/easytesting/fest-util/1.1.6/fest-util-1.1.6.pom
10-May-2018 13:06:30 [INFO] Downloaded from sonatype-nexus-public: https://oss.sonatype.org/content/groups/public/org/easytesting/fest-util/1.1.6/fest-util-1.1.6.pom (1.6 kB at 2.6 kB/s)
10-May-2018 13:06:30 [INFO] Downloading from sonatype-nexus-public: https://oss.sonatype.org/content/groups/public/com/carrotsearch/randomizedtesting/randomizedtesting-runner/2.6.1/randomizedtesting-runner-2.6.1.pom
10-May-2018 13:06:31 [INFO] Downloaded from sonatype-nexus-public: https://oss.sonatype.org/content/groups/public/com/carrotsearch/randomizedtesting/randomizedtesting-runner/2.6.1/randomizedtesting-runner-2.6.1.pom (2.7 kB at 6.9 kB/s)
10-May-2018 13:06:31 [INFO] Downloading from sonatype-nexus-public: https://oss.sonatype.org/content/groups/public/org/easytesting/fest-assert/1.4/fest-assert-1.4.jar
10-May-2018 13:06:31 [INFO] Downloading from sonatype-nexus-public: https://oss.sonatype.org/content/groups/public/org/easytesting/fest-util/1.1.6/fest-util-1.1.6.jar
10-May-2018 13:06:31 [INFO] Downloading from sonatype-nexus-public: https://oss.sonatype.org/content/groups/public/com/carrotsearch/randomizedtesting/randomizedtesting-runner/2.6.1/randomizedtesting-runner-2.6.1.jar
10-May-2018 13:06:31 [INFO] Downloaded from sonatype-nexus-public: https://oss.sonatype.org/content/groups/public/org/easytesting/fest-assert/1.4/fest-assert-1.4.jar (78 kB at 130 kB/s)
10-May-2018 13:06:31 [INFO] Downloaded from sonatype-nexus-public: https://oss.sonatype.org/content/groups/public/org/easytesting/fest-util/1.1.6/fest-util-1.1.6.jar (31 kB at 38 kB/s)
10-May-2018 13:06:32 [INFO] Downloaded from sonatype-nexus-public: https://oss.sonatype.org/content/groups/public/com/carrotsearch/randomizedtesting/randomizedtesting-runner/2.6.1/randomizedtesting-runner-2.6.1.jar (248 kB at 207 kB/s)
10-May-2018 13:06:32 [INFO]
10-May-2018 13:06:32 [INFO] --- maven-clean-plugin:2.5:clean (default-clean) @ attributes-tests ---
10-May-2018 13:06:32 [INFO]
10-May-2018 13:06:32 [INFO] --- build-helper-maven-plugin:1.8:add-source (add-source) @ attributes-tests ---
10-May-2018 13:06:32 [INFO] Downloading from central: https://repo.maven.apache.org/maven2/org/apache/maven/maven-plugin-api/2.0.1/maven-plugin-api-2.0.1.pom
10-May-2018 13:06:32 [INFO] Downloaded from central: https://repo.maven.apache.org/maven2/org/apache/maven/maven-plugin-api/2.0.1/maven-plugin-api-2.0.1.pom (643 B at 6.4 kB/s)
10-May-2018 13:06:32 [INFO] Downloading from central: https://repo.maven.apache.org/maven2/org/apache/maven/maven/2.0.1/maven-2.0.1.pom
10-May-2018 13:06:32 [INFO] Downloaded from central: https://repo.maven.apache.org/maven2/org/apache/maven/maven/2.0.1/maven-2.0.1.pom (11 kB at 112 kB/s)
10-May-2018 13:06:32 [INFO] Source directory: /var/atlassian/application-data/bamboo/xml-data/build-dir/C2-BINDER-JDK17/attributes-tests/target/src-generated added.
10-May-2018 13:06:32 [INFO]
10-May-2018 13:06:32 [INFO] --- maven-resources-plugin:2.6:resources (default-resources) @ attributes-tests ---
10-May-2018 13:06:32 [INFO] Using 'UTF-8' encoding to copy filtered resources.
10-May-2018 13:06:32 [INFO] skip non existing resourceDirectory /var/atlassian/application-data/bamboo/xml-data/build-dir/C2-BINDER-JDK17/attributes-tests/src/main/resources
10-May-2018 13:06:32 [INFO]
10-May-2018 13:06:32 [INFO] --- maven-compiler-plugin:3.3:compile (default-compile) @ attributes-tests ---
10-May-2018 13:06:32 [INFO] No sources to compile
10-May-2018 13:06:32 [INFO]
10-May-2018 13:06:32 [INFO] --- maven-processor-plugin:2.2.0:process-test (process-test) @ attributes-tests ---
10-May-2018 13:06:32 [INFO] Downloading from central: https://repo.maven.apache.org/maven2/org/apache/maven/maven-plugin-api/3.0.1/maven-plugin-api-3.0.1.pom
10-May-2018 13:06:32 [INFO] Downloaded from central: https://repo.maven.apache.org/maven2/org/apache/maven/maven-plugin-api/3.0.1/maven-plugin-api-3.0.1.pom (2.3 kB at 20 kB/s)
10-May-2018 13:06:32 [INFO] Downloading from central: https://repo.maven.apache.org/maven2/org/apache/maven/maven/3.0.1/maven-3.0.1.pom
10-May-2018 13:06:32 [INFO] Downloaded from central: https://repo.maven.apache.org/maven2/org/apache/maven/maven/3.0.1/maven-3.0.1.pom (23 kB at 211 kB/s)
10-May-2018 13:06:32 [INFO] Downloading from central: https://repo.maven.apache.org/maven2/org/apache/maven/maven-model/3.0.1/maven-model-3.0.1.pom
10-May-2018 13:06:32 [INFO] Downloaded from central: https://repo.maven.apache.org/maven2/org/apache/maven/maven-model/3.0.1/maven-model-3.0.1.pom (3.9 kB at 39 kB/s)
10-May-2018 13:06:32 [INFO] Downloading from central: https://repo.maven.apache.org/maven2/org/apache/maven/maven-artifact/3.0.1/maven-artifact-3.0.1.pom
10-May-2018 13:06:33 [INFO] Downloaded from central: https://repo.maven.apache.org/maven2/org/apache/maven/maven-artifact/3.0.1/maven-artifact-3.0.1.pom (1.9 kB at 19 kB/s)
10-May-2018 13:06:33 [INFO] Downloading from central: https://repo.maven.apache.org/maven2/org/sonatype/sisu/sisu-inject-plexus/1.4.3.1/sisu-inject-plexus-1.4.3.1.pom
10-May-2018 13:06:33 [INFO] Downloaded from central: https://repo.maven.apache.org/maven2/org/sonatype/sisu/sisu-inject-plexus/1.4.3.1/sisu-inject-plexus-1.4.3.1.pom (5.2 kB at 52 kB/s)
10-May-2018 13:06:33 [INFO] Downloading from central: https://repo.maven.apache.org/maven2/org/sonatype/sisu/inject/guice-plexus/1.4.3.1/guice-plexus-1.4.3.1.pom
10-May-2018 13:06:33 [INFO] Downloaded from central: https://repo.maven.apache.org/maven2/org/sonatype/sisu/inject/guice-plexus/1.4.3.1/guice-plexus-1.4.3.1.pom (3.0 kB at 29 kB/s)
10-May-2018 13:06:33 [INFO] Downloading from central: https://repo.maven.apache.org/maven2/org/sonatype/sisu/inject/guice-bean/1.4.3.1/guice-bean-1.4.3.1.pom
10-May-2018 13:06:33 [INFO] Downloaded from central: https://repo.maven.apache.org/maven2/org/sonatype/sisu/inject/guice-bean/1.4.3.1/guice-bean-1.4.3.1.pom (2.5 kB at 25 kB/s)
10-May-2018 13:06:33 [INFO] Downloading from central: https://repo.maven.apache.org/maven2/org/sonatype/sisu/sisu-inject/1.4.3.1/sisu-inject-1.4.3.1.pom
10-May-2018 13:06:33 [INFO] Downloaded from central: https://repo.maven.apache.org/maven2/org/sonatype/sisu/sisu-inject/1.4.3.1/sisu-inject-1.4.3.1.pom (1.2 kB at 11 kB/s)
10-May-2018 13:06:33 [INFO] Downloading from central: https://repo.maven.apache.org/maven2/org/sonatype/sisu/sisu-parent/1.4.3.1/sisu-parent-1.4.3.1.pom
10-May-2018 13:06:33 [INFO] Downloaded from central: https://repo.maven.apache.org/maven2/org/sonatype/sisu/sisu-parent/1.4.3.1/sisu-parent-1.4.3.1.pom (8.1 kB at 78 kB/s)
10-May-2018 13:06:33 [INFO] Downloading from central: https://repo.maven.apache.org/maven2/org/sonatype/sisu/sisu-inject-bean/1.4.3.1/sisu-inject-bean-1.4.3.1.pom
10-May-2018 13:06:33 [INFO] Downloaded from central: https://repo.maven.apache.org/maven2/org/sonatype/sisu/sisu-inject-bean/1.4.3.1/sisu-inject-bean-1.4.3.1.pom (5.3 kB at 51 kB/s)
10-May-2018 13:06:33 [INFO] Downloading from central: https://repo.maven.apache.org/maven2/org/sonatype/sisu/sisu-guice/2.9.1/sisu-guice-2.9.1.pom
10-May-2018 13:06:33 [INFO] Downloaded from central: https://repo.maven.apache.org/maven2/org/sonatype/sisu/sisu-guice/2.9.1/sisu-guice-2.9.1.pom (6.7 kB at 65 kB/s)
10-May-2018 13:06:33 [INFO] Downloading from central: https://repo.maven.apache.org/maven2/org/sonatype/sisu/inject/guice-parent/2.9.1/guice-parent-2.9.1.pom
10-May-2018 13:06:33 [INFO] Downloaded from central: https://repo.maven.apache.org/maven2/org/sonatype/sisu/inject/guice-parent/2.9.1/guice-parent-2.9.1.pom (12 kB at 123 kB/s)
10-May-2018 13:06:33 [INFO] Downloading from central: https://repo.maven.apache.org/maven2/org/apache/maven/maven-core/3.0.1/maven-core-3.0.1.pom
10-May-2018 13:06:34 [INFO] Downloaded from central: https://repo.maven.apache.org/maven2/org/apache/maven/maven-core/3.0.1/maven-core-3.0.1.pom (6.6 kB at 65 kB/s)
10-May-2018 13:06:34 [INFO] Downloading from central: https://repo.maven.apache.org/maven2/org/apache/maven/maven-settings/3.0.1/maven-settings-3.0.1.pom
10-May-2018 13:06:34 [INFO] Downloaded from central: https://repo.maven.apache.org/maven2/org/apache/maven/maven-settings/3.0.1/maven-settings-3.0.1.pom (1.9 kB at 17 kB/s)
10-May-2018 13:06:34 [INFO] Downloading from central: https://repo.maven.apache.org/maven2/org/apache/maven/maven-settings-builder/3.0.1/maven-settings-builder-3.0.1.pom
10-May-2018 13:06:34 [INFO] Downloaded from central: https://repo.maven.apache.org/maven2/org/apache/maven/maven-settings-builder/3.0.1/maven-settings-builder-3.0.1.pom (2.2 kB at 21 kB/s)
10-May-2018 13:06:34 [INFO] Downloading from central: https://repo.maven.apache.org/maven2/org/apache/maven/maven-repository-metadata/3.0.1/maven-repository-metadata-3.0.1.pom
10-May-2018 13:06:34 [INFO] Downloaded from central: https://repo.maven.apache.org/maven2/org/apache/maven/maven-repository-metadata/3.0.1/maven-repository-metadata-3.0.1.pom (1.9 kB at 18 kB/s)
10-May-2018 13:06:34 [INFO] Downloading from central: https://repo.maven.apache.org/maven2/org/apache/maven/maven-model-builder/3.0.1/maven-model-builder-3.0.1.pom
10-May-2018 13:06:34 [INFO] Downloaded from central: https://repo.maven.apache.org/maven2/org/apache/maven/maven-model-builder/3.0.1/maven-model-builder-3.0.1.pom (2.2 kB at 22 kB/s)
10-May-2018 13:06:34 [INFO] Downloading from central: https://repo.maven.apache.org/maven2/org/apache/maven/maven-aether-provider/3.0.1/maven-aether-provider-3.0.1.pom
10-May-2018 13:06:34 [INFO] Downloaded from central: https://repo.maven.apache.org/maven2/org/apache/maven/maven-aether-provider/3.0.1/maven-aether-provider-3.0.1.pom (2.8 kB at 27 kB/s)
10-May-2018 13:06:34 [INFO] Downloading from central: https://repo.maven.apache.org/maven2/org/sonatype/aether/aether-api/1.8/aether-api-1.8.pom
10-May-2018 13:06:34 [INFO] Downloaded from central: https://repo.maven.apache.org/maven2/org/sonatype/aether/aether-api/1.8/aether-api-1.8.pom (1.3 kB at 13 kB/s)
10-May-2018 13:06:34 [INFO] Downloading from central: https://repo.maven.apache.org/maven2/org/sonatype/aether/aether-parent/1.8/aether-parent-1.8.pom
10-May-2018 13:06:34 [INFO] Downloaded from central: https://repo.maven.apache.org/maven2/org/sonatype/aether/aether-parent/1.8/aether-parent-1.8.pom (9.3 kB at 90 kB/s)
10-May-2018 13:06:34 [INFO] Downloading from central: https://repo.maven.apache.org/maven2/org/sonatype/aether/aether-spi/1.8/aether-spi-1.8.pom
10-May-2018 13:06:34 [INFO] Downloaded from central: https://repo.maven.apache.org/maven2/org/sonatype/aether/aether-spi/1.8/aether-spi-1.8.pom (1.3 kB at 12 kB/s)
10-May-2018 13:06:34 [INFO] Downloading from central: https://repo.maven.apache.org/maven2/org/sonatype/aether/aether-util/1.8/aether-util-1.8.pom
10-May-2018 13:06:35 [INFO] Downloaded from central: https://repo.maven.apache.org/maven2/org/sonatype/aether/aether-util/1.8/aether-util-1.8.pom (1.6 kB at 15 kB/s)
10-May-2018 13:06:35 [INFO] Downloading from central: https://repo.maven.apache.org/maven2/org/sonatype/aether/aether-impl/1.8/aether-impl-1.8.pom
10-May-2018 13:06:35 [INFO] Downloaded from central: https://repo.maven.apache.org/maven2/org/sonatype/aether/aether-impl/1.8/aether-impl-1.8.pom (2.9 kB at 28 kB/s)
10-May-2018 13:06:35 [INFO] Downloading from central: https://repo.maven.apache.org/maven2/org/codehaus/plexus/plexus-classworlds/2.4/plexus-classworlds-2.4.pom
10-May-2018 13:06:35 [INFO] Downloaded from central: https://repo.maven.apache.org/maven2/org/codehaus/plexus/plexus-classworlds/2.4/plexus-classworlds-2.4.pom (3.9 kB at 38 kB/s)
10-May-2018 13:06:35 [INFO] Downloading from central: https://repo.maven.apache.org/maven2/org/codehaus/plexus/plexus-utils/3.0.1/plexus-utils-3.0.1.pom
10-May-2018 13:06:35 [INFO] Downloaded from central: https://repo.maven.apache.org/maven2/org/codehaus/plexus/plexus-utils/3.0.1/plexus-utils-3.0.1.pom (2.5 kB at 25 kB/s)
10-May-2018 13:06:35 [INFO] Downloading from central: https://repo.maven.apache.org/maven2/org/apache/maven/maven-plugin-api/3.0.1/maven-plugin-api-3.0.1.jar
10-May-2018 13:06:35 [INFO] Downloading from central: https://repo.maven.apache.org/maven2/org/apache/maven/maven-model/3.0.1/maven-model-3.0.1.jar
10-May-2018 13:06:35 [INFO] Downloading from central: https://repo.maven.apache.org/maven2/org/apache/maven/maven-artifact/3.0.1/maven-artifact-3.0.1.jar
10-May-2018 13:06:35 [INFO] Downloading from central: https://repo.maven.apache.org/maven2/org/sonatype/sisu/sisu-inject-plexus/1.4.3.1/sisu-inject-plexus-1.4.3.1.jar
10-May-2018 13:06:35 [INFO] Downloading from central: https://repo.maven.apache.org/maven2/org/sonatype/sisu/sisu-inject-bean/1.4.3.1/sisu-inject-bean-1.4.3.1.jar
10-May-2018 13:06:35 [INFO] Downloaded from central: https://repo.maven.apache.org/maven2/org/apache/maven/maven-artifact/3.0.1/maven-artifact-3.0.1.jar (52 kB at 486 kB/s)
10-May-2018 13:06:35 [INFO] Downloading from central: https://repo.maven.apache.org/maven2/org/sonatype/sisu/sisu-guice/2.9.1/sisu-guice-2.9.1-noaop.jar
10-May-2018 13:06:35 [INFO] Downloaded from central: https://repo.maven.apache.org/maven2/org/apache/maven/maven-plugin-api/3.0.1/maven-plugin-api-3.0.1.jar (49 kB at 453 kB/s)
10-May-2018 13:06:35 [INFO] Downloading from central: https://repo.maven.apache.org/maven2/org/apache/maven/maven-core/3.0.1/maven-core-3.0.1.jar
10-May-2018 13:06:35 [INFO] Downloaded from central: https://repo.maven.apache.org/maven2/org/apache/maven/maven-model/3.0.1/maven-model-3.0.1.jar (165 kB at 1.1 MB/s)
10-May-2018 13:06:35 [INFO] Downloading from central: https://repo.maven.apache.org/maven2/org/apache/maven/maven-settings/3.0.1/maven-settings-3.0.1.jar
10-May-2018 13:06:35 [INFO] Downloaded from central: https://repo.maven.apache.org/maven2/org/sonatype/sisu/sisu-inject-bean/1.4.3.1/sisu-inject-bean-1.4.3.1.jar (160 kB at 966 kB/s)
10-May-2018 13:06:35 [INFO] Downloading from central: https://repo.maven.apache.org/maven2/org/apache/maven/maven-settings-builder/3.0.1/maven-settings-builder-3.0.1.jar
10-May-2018 13:06:35 [INFO] Downloaded from central: https://repo.maven.apache.org/maven2/org/sonatype/sisu/sisu-inject-plexus/1.4.3.1/sisu-inject-plexus-1.4.3.1.jar (205 kB at 1.0 MB/s)
10-May-2018 13:06:35 [INFO] Downloading from central: https://repo.maven.apache.org/maven2/org/apache/maven/maven-repository-metadata/3.0.1/maven-repository-metadata-3.0.1.jar
10-May-2018 13:06:35 [INFO] Downloaded from central: https://repo.maven.apache.org/maven2/org/apache/maven/maven-settings/3.0.1/maven-settings-3.0.1.jar (47 kB at 171 kB/s)
10-May-2018 13:06:35 [INFO] Downloading from central: https://repo.maven.apache.org/maven2/org/apache/maven/maven-model-builder/3.0.1/maven-model-builder-3.0.1.jar
10-May-2018 13:06:35 [INFO] Downloaded from central: https://repo.maven.apache.org/maven2/org/apache/maven/maven-settings-builder/3.0.1/maven-settings-builder-3.0.1.jar (41 kB at 148 kB/s)
10-May-2018 13:06:35 [INFO] Downloading from central: https://repo.maven.apache.org/maven2/org/apache/maven/maven-aether-provider/3.0.1/maven-aether-provider-3.0.1.jar
10-May-2018 13:06:35 [INFO] Downloaded from central: https://repo.maven.apache.org/maven2/org/apache/maven/maven-core/3.0.1/maven-core-3.0.1.jar (530 kB at 1.7 MB/s)
10-May-2018 13:06:35 [INFO] Downloading from central: https://repo.maven.apache.org/maven2/org/sonatype/aether/aether-spi/1.8/aether-spi-1.8.jar
10-May-2018 13:06:35 [INFO] Downloaded from central: https://repo.maven.apache.org/maven2/org/apache/maven/maven-repository-metadata/3.0.1/maven-repository-metadata-3.0.1.jar (30 kB at 96 kB/s)
10-May-2018 13:06:35 [INFO] Downloading from central: https://repo.maven.apache.org/maven2/org/sonatype/aether/aether-impl/1.8/aether-impl-1.8.jar
10-May-2018 13:06:35 [INFO] Downloaded from central: https://repo.maven.apache.org/maven2/org/sonatype/sisu/sisu-guice/2.9.1/sisu-guice-2.9.1-noaop.jar (477 kB at 1.5 MB/s)
10-May-2018 13:06:35 [INFO] Downloading from central: https://repo.maven.apache.org/maven2/org/sonatype/aether/aether-api/1.8/aether-api-1.8.jar
10-May-2018 13:06:35 [INFO] Downloaded from central: https://repo.maven.apache.org/maven2/org/apache/maven/maven-aether-provider/3.0.1/maven-aether-provider-3.0.1.jar (52 kB at 134 kB/s)
10-May-2018 13:06:35 [INFO] Downloading from central: https://repo.maven.apache.org/maven2/org/sonatype/aether/aether-util/1.8/aether-util-1.8.jar
10-May-2018 13:06:35 [INFO] Downloaded from central: https://repo.maven.apache.org/maven2/org/apache/maven/maven-model-builder/3.0.1/maven-model-builder-3.0.1.jar (148 kB at 355 kB/s)
10-May-2018 13:06:35 [INFO] Downloading from central: https://repo.maven.apache.org/maven2/org/codehaus/plexus/plexus-classworlds/2.4/plexus-classworlds-2.4.jar
10-May-2018 13:06:35 [INFO] Downloaded from central: https://repo.maven.apache.org/maven2/org/sonatype/aether/aether-spi/1.8/aether-spi-1.8.jar (14 kB at 34 kB/s)
10-May-2018 13:06:35 [INFO] Downloading from central: https://repo.maven.apache.org/maven2/org/codehaus/plexus/plexus-utils/3.0.1/plexus-utils-3.0.1.jar
10-May-2018 13:06:35 [INFO] Downloaded from central: https://repo.maven.apache.org/maven2/org/sonatype/aether/aether-impl/1.8/aether-impl-1.8.jar (109 kB at 250 kB/s)
10-May-2018 13:06:35 [INFO] Downloaded from central: https://repo.maven.apache.org/maven2/org/sonatype/aether/aether-api/1.8/aether-api-1.8.jar (77 kB at 177 kB/s)
10-May-2018 13:06:35 [INFO] Downloaded from central: https://repo.maven.apache.org/maven2/org/sonatype/aether/aether-util/1.8/aether-util-1.8.jar (115 kB at 221 kB/s)
10-May-2018 13:06:35 [INFO] Downloaded from central: https://repo.maven.apache.org/maven2/org/codehaus/plexus/plexus-classworlds/2.4/plexus-classworlds-2.4.jar (47 kB at 88 kB/s)
10-May-2018 13:06:36 [INFO] Downloaded from central: https://repo.maven.apache.org/maven2/org/codehaus/plexus/plexus-utils/3.0.1/plexus-utils-3.0.1.jar (227 kB at 365 kB/s)
10-May-2018 13:06:36 [INFO] Source directory: /var/atlassian/application-data/bamboo/xml-data/build-dir/C2-BINDER-JDK17/attributes-tests/target/src-generated added
10-May-2018 13:06:36 [INFO] No processors specified. Using default discovery mechanism.
10-May-2018 13:06:36 [INFO] javac option: -cp
10-May-2018 13:06:36 [INFO] javac option: /var/atlassian/application-data/bamboo/xml-data/build-dir/C2-BINDER-JDK17/attributes-processor/target/attributes-processor-1.3.3-SNAPSHOT.jar:/var/atlassian/application-data/bamboo/xml-data/build-dir/C2-BINDER-JDK17/attributes-binder/target/attributes-binder-1.3.3-SNAPSHOT.jar:/var/atlassian/application-data/bamboo/.m2/AGENT-61702145/repository/com/thoughtworks/qdox/qdox/1.12.1/qdox-1.12.1.jar:/var/atlassian/application-data/bamboo/.m2/AGENT-61702145/repository/org/apache/velocity/velocity-engine-core/2.0/velocity-engine-core-2.0.jar:/var/atlassian/application-data/bamboo/.m2/AGENT-61702145/repository/org/apache/commons/commons-lang3/3.5/commons-lang3-3.5.jar:/var/atlassian/application-data/bamboo/.m2/AGENT-61702145/repository/org/slf4j/slf4j-api/1.7.25/slf4j-api-1.7.25.jar:/var/atlassian/application-data/bamboo/.m2/AGENT-61702145/repository/org/apache/maven/maven-plugin-api/3.0.1/maven-plugin-api-3.0.1.jar:/var/atlassian/application-data/bamboo/.m2/AGENT-61702145/repository/org/apache/maven/maven-model/3.0.1/maven-model-3.0.1.jar:/var/atlassian/application-data/bamboo/.m2/AGENT-61702145/repository/org/apache/maven/maven-artifact/3.0.1/maven-artifact-3.0.1.jar:/var/atlassian/application-data/bamboo/.m2/AGENT-61702145/repository/org/sonatype/sisu/sisu-inject-plexus/1.4.3.1/sisu-inject-plexus-1.4.3.1.jar:/var/atlassian/application-data/bamboo/.m2/AGENT-61702145/repository/org/sonatype/sisu/sisu-inject-bean/1.4.3.1/sisu-inject-bean-1.4.3.1.jar:/var/atlassian/application-data/bamboo/.m2/AGENT-61702145/repository/org/sonatype/sisu/sisu-guice/2.9.1/sisu-guice-2.9.1-noaop.jar:/var/atlassian/application-data/bamboo/.m2/AGENT-61702145/repository/org/apache/maven/maven-core/3.0.1/maven-core-3.0.1.jar:/var/atlassian/application-data/bamboo/.m2/AGENT-61702145/repository/org/apache/maven/maven-settings/3.0.1/maven-settings-3.0.1.jar:/var/atlassian/application-data/bamboo/.m2/AGENT-61702145/repository/org/apache/maven/maven-settings-builder/3.0.1/maven-settings-builder-3.0.1.jar:/var/atlassian/application-data/bamboo/.m2/AGENT-61702145/repository/org/apache/maven/maven-repository-metadata/3.0.1/maven-repository-metadata-3.0.1.jar:/var/atlassian/application-data/bamboo/.m2/AGENT-61702145/repository/org/apache/maven/maven-model-builder/3.0.1/maven-model-builder-3.0.1.jar:/var/atlassian/application-data/bamboo/.m2/AGENT-61702145/repository/org/apache/maven/maven-aether-provider/3.0.1/maven-aether-provider-3.0.1.jar:/var/atlassian/application-data/bamboo/.m2/AGENT-61702145/repository/org/sonatype/aether/aether-spi/1.8/aether-spi-1.8.jar:/var/atlassian/application-data/bamboo/.m2/AGENT-61702145/repository/org/sonatype/aether/aether-impl/1.8/aether-impl-1.8.jar:/var/atlassian/application-data/bamboo/.m2/AGENT-61702145/repository/org/sonatype/aether/aether-api/1.8/aether-api-1.8.jar:/var/atlassian/application-data/bamboo/.m2/AGENT-61702145/repository/org/sonatype/aether/aether-util/1.8/aether-util-1.8.jar:/var/atlassian/application-data/bamboo/.m2/AGENT-61702145/repository/org/codehaus/plexus/plexus-interpolation/1.14/plexus-interpolation-1.14.jar:/var/atlassian/application-data/bamboo/.m2/AGENT-61702145/repository/org/codehaus/plexus/plexus-classworlds/2.4/plexus-classworlds-2.4.jar:/var/atlassian/application-data/bamboo/.m2/AGENT-61702145/repository/org/codehaus/plexus/plexus-component-annotations/1.5.5/plexus-component-annotations-1.5.5.jar:/var/atlassian/application-data/bamboo/.m2/AGENT-61702145/repository/org/sonatype/plexus/plexus-sec-dispatcher/1.3/plexus-sec-dispatcher-1.3.jar:/var/atlassian/application-data/bamboo/.m2/AGENT-61702145/repository/org/sonatype/plexus/plexus-cipher/1.4/plexus-cipher-1.4.jar:/var/atlassian/application-data/bamboo/.m2/AGENT-61702145/repository/org/apache/maven/plugin-tools/maven-plugin-annotations/3.1/maven-plugin-annotations-3.1.jar:/var/atlassian/application-data/bamboo/.m2/AGENT-61702145/repository/org/codehaus/plexus/plexus-utils/3.0.1/plexus-utils-3.0.1.jar:/var/atlassian/application-data/bamboo/xml-data/build-dir/C2-BINDER-JDK17/attributes-tests/src/test/resources:/var/atlassian/application-data/bamboo/xml-data/build-dir/C2-BINDER-JDK17/attributes-tests/target/test-classes:/var/atlassian/application-data/bamboo/xml-data/build-dir/C2-BINDER-JDK17/attributes-tests/target/classes:/var/atlassian/application-data/bamboo/.m2/AGENT-61702145/repository/org/simpleframework/simple-xml/2.7/simple-xml-2.7.jar:/var/atlassian/application-data/bamboo/.m2/AGENT-61702145/repository/org/carrot2/shaded/carrot2-guava/18.0/carrot2-guava-18.0.jar:/var/atlassian/application-data/bamboo/.m2/AGENT-61702145/repository/junit/junit/4.10/junit-4.10.jar:/var/atlassian/application-data/bamboo/.m2/AGENT-61702145/repository/org/hamcrest/hamcrest-core/1.1/hamcrest-core-1.1.jar:/var/atlassian/application-data/bamboo/.m2/AGENT-61702145/repository/org/easytesting/fest-assert/1.4/fest-assert-1.4.jar:/var/atlassian/application-data/bamboo/.m2/AGENT-61702145/repository/org/easytesting/fest-util/1.1.6/fest-util-1.1.6.jar:/var/atlassian/application-data/bamboo/.m2/AGENT-61702145/repository/com/carrotsearch/randomizedtesting/randomizedtesting-runner/2.6.1/randomizedtesting-runner-2.6.1.jar:
10-May-2018 13:06:36 [INFO] javac option: -proc:only
10-May-2018 13:06:36 [INFO] javac option: -d
10-May-2018 13:06:36 [INFO] javac option: /var/atlassian/application-data/bamboo/xml-data/build-dir/C2-BINDER-JDK17/attributes-tests/target/test-classes
10-May-2018 13:06:36 [INFO] javac option: -s
10-May-2018 13:06:36 [INFO] javac option: /var/atlassian/application-data/bamboo/xml-data/build-dir/C2-BINDER-JDK17/attributes-tests/target/src-generated
10-May-2018 13:06:36 SLF4J: Failed to load class "org.slf4j.impl.StaticLoggerBinder".
10-May-2018 13:06:36 SLF4J: Defaulting to no-operation (NOP) logger implementation
10-May-2018 13:06:36 SLF4J: See http://www.slf4j.org/codes.html#StaticLoggerBinder for further details.
10-May-2018 13:06:36 62 @Bindable metadata processed in round 1 in 0.52 secs.
10-May-2018 13:06:36 [INFO] diagnostic warning: /var/atlassian/application-data/bamboo/.m2/AGENT-61702145/repository/com/carrotsearch/randomizedtesting/randomizedtesting-runner/2.6.1/randomizedtesting-runner-2.6.1.jar(com/carrotsearch/randomizedtesting/RandomizedTest.class): major version 52 is newer than 51, the highest major version supported by this compiler.
10-May-2018 13:06:36   It is recommended that the compiler be upgraded.
10-May-2018 13:06:36 [INFO] diagnostic warning: /var/atlassian/application-data/bamboo/.m2/AGENT-61702145/repository/com/carrotsearch/randomizedtesting/randomizedtesting-runner/2.6.1/randomizedtesting-runner-2.6.1.jar(com/carrotsearch/randomizedtesting/RandomizedTest.class): major version 52 is newer than 51, the highest major version supported by this compiler.
10-May-2018 13:06:36   It is recommended that the compiler be upgraded.
10-May-2018 13:06:37 [INFO] diagnostic warning: /var/atlassian/application-data/bamboo/.m2/AGENT-61702145/repository/com/carrotsearch/randomizedtesting/randomizedtesting-runner/2.6.1/randomizedtesting-runner-2.6.1.jar(com/carrotsearch/randomizedtesting/RandomizedTest.class): major version 52 is newer than 51, the highest major version supported by this compiler.
10-May-2018 13:06:37   It is recommended that the compiler be upgraded.
10-May-2018 13:06:37 [INFO]
10-May-2018 13:06:37 [INFO] --- maven-resources-plugin:2.6:testResources (default-testResources) @ attributes-tests ---
10-May-2018 13:06:37 [INFO] Using 'UTF-8' encoding to copy filtered resources.
10-May-2018 13:06:37 [INFO] skip non existing resourceDirectory /var/atlassian/application-data/bamboo/xml-data/build-dir/C2-BINDER-JDK17/attributes-tests/src/test/resources
10-May-2018 13:06:37 [INFO]
10-May-2018 13:06:37 [INFO] --- maven-compiler-plugin:3.3:testCompile (default-testCompile) @ attributes-tests ---
10-May-2018 13:06:37 [INFO] Changes detected - recompiling the module!
10-May-2018 13:06:37 [INFO] Compiling 124 source files to /var/atlassian/application-data/bamboo/xml-data/build-dir/C2-BINDER-JDK17/attributes-tests/target/test-classes
10-May-2018 13:06:37 [INFO]
10-May-2018 13:06:37 [INFO] --- maven-surefire-plugin:2.12:test (default-test) @ attributes-tests ---
10-May-2018 13:06:37 [INFO] Downloading from central: https://repo.maven.apache.org/maven2/org/apache/maven/surefire/surefire-booter/2.12/surefire-booter-2.12.pom
10-May-2018 13:06:37 [INFO] Downloaded from central: https://repo.maven.apache.org/maven2/org/apache/maven/surefire/surefire-booter/2.12/surefire-booter-2.12.pom (3.0 kB at 31 kB/s)
10-May-2018 13:06:37 [INFO] Downloading from central: https://repo.maven.apache.org/maven2/org/apache/maven/surefire/surefire-api/2.12/surefire-api-2.12.pom
10-May-2018 13:06:37 [INFO] Downloaded from central: https://repo.maven.apache.org/maven2/org/apache/maven/surefire/surefire-api/2.12/surefire-api-2.12.pom (2.5 kB at 25 kB/s)
10-May-2018 13:06:37 [INFO] Downloading from central: https://repo.maven.apache.org/maven2/org/apache/maven/surefire/maven-surefire-common/2.12/maven-surefire-common-2.12.pom
10-May-2018 13:06:37 [INFO] Downloaded from central: https://repo.maven.apache.org/maven2/org/apache/maven/surefire/maven-surefire-common/2.12/maven-surefire-common-2.12.pom (5.1 kB at 52 kB/s)
10-May-2018 13:06:38 [INFO] Downloading from central: https://repo.maven.apache.org/maven2/org/apache/maven/surefire/surefire-booter/2.12/surefire-booter-2.12.jar
10-May-2018 13:06:38 [INFO] Downloading from central: https://repo.maven.apache.org/maven2/org/apache/maven/surefire/surefire-api/2.12/surefire-api-2.12.jar
10-May-2018 13:06:38 [INFO] Downloading from central: https://repo.maven.apache.org/maven2/org/apache/maven/surefire/maven-surefire-common/2.12/maven-surefire-common-2.12.jar
10-May-2018 13:06:38 [INFO] Downloaded from central: https://repo.maven.apache.org/maven2/org/apache/maven/surefire/surefire-booter/2.12/surefire-booter-2.12.jar (33 kB at 302 kB/s)
10-May-2018 13:06:38 [INFO] Downloaded from central: https://repo.maven.apache.org/maven2/org/apache/maven/surefire/surefire-api/2.12/surefire-api-2.12.jar (124 kB at 900 kB/s)
10-May-2018 13:06:38 [INFO] Downloaded from central: https://repo.maven.apache.org/maven2/org/apache/maven/surefire/maven-surefire-common/2.12/maven-surefire-common-2.12.jar (224 kB at 1.4 MB/s)
10-May-2018 13:06:38 [INFO] Tests are skipped.
10-May-2018 13:06:38 [INFO]
10-May-2018 13:06:38 [INFO] --- maven-jar-plugin:2.4:jar (default-jar) @ attributes-tests ---
10-May-2018 13:06:38 [WARNING] JAR will be empty - no content was marked for inclusion!
10-May-2018 13:06:38 [INFO] Building jar: /var/atlassian/application-data/bamboo/xml-data/build-dir/C2-BINDER-JDK17/attributes-tests/target/attributes-tests-1.3.3-SNAPSHOT.jar
10-May-2018 13:06:38 [INFO]
10-May-2018 13:06:38 [INFO] --- junit4-maven-plugin:2.6.1:junit4 (integration-tests) @ attributes-tests ---
10-May-2018 13:06:38 [INFO] Downloading from central: https://repo.maven.apache.org/maven2/com/carrotsearch/randomizedtesting/junit4-ant/2.6.1/junit4-ant-2.6.1.pom
10-May-2018 13:06:38 [INFO] Downloaded from central: https://repo.maven.apache.org/maven2/com/carrotsearch/randomizedtesting/junit4-ant/2.6.1/junit4-ant-2.6.1.pom (11 kB at 34 kB/s)
10-May-2018 13:06:38 [INFO] Downloading from central: https://repo.maven.apache.org/maven2/com/carrotsearch/randomizedtesting/junit4-ant/2.6.1/junit4-ant-2.6.1.jar
10-May-2018 13:06:38 [INFO] Downloading from central: https://repo.maven.apache.org/maven2/com/carrotsearch/randomizedtesting/randomizedtesting-runner/2.6.1/randomizedtesting-runner-2.6.1.jar
10-May-2018 13:06:38 [INFO] Downloaded from central: https://repo.maven.apache.org/maven2/com/carrotsearch/randomizedtesting/randomizedtesting-runner/2.6.1/randomizedtesting-runner-2.6.1.jar (0 B at 0 B/s)
10-May-2018 13:06:39 [INFO] Downloaded from central: https://repo.maven.apache.org/maven2/com/carrotsearch/randomizedtesting/junit4-ant/2.6.1/junit4-ant-2.6.1.jar (1.5 MB at 1.5 MB/s)
10-May-2018 13:06:39 [WARNING] Error injecting: com.carrotsearch.maven.plugins.junit4.JUnit4Mojo
10-May-2018 13:06:39 java.lang.TypeNotPresentException: Type com.carrotsearch.maven.plugins.junit4.JUnit4Mojo not present
10-May-2018 13:06:39     at org.eclipse.sisu.space.URLClassSpace.loadClass (URLClassSpace.java:147)
10-May-2018 13:06:39     at org.eclipse.sisu.space.NamedClass.load (NamedClass.java:46)
10-May-2018 13:06:39     at org.eclipse.sisu.space.AbstractDeferredClass.get (AbstractDeferredClass.java:48)
10-May-2018 13:06:39     at com.google.inject.internal.ProviderInternalFactory.provision (ProviderInternalFactory.java:81)
10-May-2018 13:06:39     at com.google.inject.internal.InternalFactoryToInitializableAdapter.provision (InternalFactoryToInitializableAdapter.java:53)
10-May-2018 13:06:39     at com.google.inject.internal.ProviderInternalFactory$1.call (ProviderInternalFactory.java:65)
10-May-2018 13:06:39     at com.google.inject.internal.ProvisionListenerStackCallback$Provision.provision (ProvisionListenerStackCallback.java:115)
10-May-2018 13:06:39     at com.google.inject.internal.ProvisionListenerStackCallback$Provision.provision (ProvisionListenerStackCallback.java:133)
10-May-2018 13:06:39     at com.google.inject.internal.ProvisionListenerStackCallback.provision (ProvisionListenerStackCallback.java:68)
10-May-2018 13:06:39     at com.google.inject.internal.ProviderInternalFactory.circularGet (ProviderInternalFactory.java:63)
10-May-2018 13:06:39     at com.google.inject.internal.InternalFactoryToInitializableAdapter.get (InternalFactoryToInitializableAdapter.java:45)
10-May-2018 13:06:39     at com.google.inject.internal.InjectorImpl$2$1.call (InjectorImpl.java:1016)
10-May-2018 13:06:39     at com.google.inject.internal.InjectorImpl.callInContext (InjectorImpl.java:1092)
10-May-2018 13:06:39     at com.google.inject.internal.InjectorImpl$2.get (InjectorImpl.java:1012)
10-May-2018 13:06:39     at org.eclipse.sisu.inject.Guice4$1.get (Guice4.java:162)
10-May-2018 13:06:39     at org.eclipse.sisu.inject.LazyBeanEntry.getValue (LazyBeanEntry.java:81)
10-May-2018 13:06:39     at org.eclipse.sisu.plexus.LazyPlexusBean.getValue (LazyPlexusBean.java:51)
10-May-2018 13:06:39     at org.codehaus.plexus.DefaultPlexusContainer.lookup (DefaultPlexusContainer.java:263)
10-May-2018 13:06:39     at org.codehaus.plexus.DefaultPlexusContainer.lookup (DefaultPlexusContainer.java:255)
10-May-2018 13:06:39     at org.apache.maven.plugin.internal.DefaultMavenPluginManager.getConfiguredMojo (DefaultMavenPluginManager.java:519)
10-May-2018 13:06:39     at org.apache.maven.plugin.DefaultBuildPluginManager.executeMojo (DefaultBuildPluginManager.java:121)
10-May-2018 13:06:39     at org.apache.maven.lifecycle.internal.MojoExecutor.execute (MojoExecutor.java:208)
10-May-2018 13:06:39     at org.apache.maven.lifecycle.internal.MojoExecutor.execute (MojoExecutor.java:154)
10-May-2018 13:06:39     at org.apache.maven.lifecycle.internal.MojoExecutor.execute (MojoExecutor.java:146)
10-May-2018 13:06:39     at org.apache.maven.lifecycle.internal.LifecycleModuleBuilder.buildProject (LifecycleModuleBuilder.java:117)
10-May-2018 13:06:39     at org.apache.maven.lifecycle.internal.LifecycleModuleBuilder.buildProject (LifecycleModuleBuilder.java:81)
10-May-2018 13:06:39     at org.apache.maven.lifecycle.internal.builder.singlethreaded.SingleThreadedBuilder.build (SingleThreadedBuilder.java:51)
10-May-2018 13:06:39     at org.apache.maven.lifecycle.internal.LifecycleStarter.execute (LifecycleStarter.java:128)
10-May-2018 13:06:39     at org.apache.maven.DefaultMaven.doExecute (DefaultMaven.java:309)
10-May-2018 13:06:39     at org.apache.maven.DefaultMaven.doExecute (DefaultMaven.java:194)
10-May-2018 13:06:39     at org.apache.maven.DefaultMaven.execute (DefaultMaven.java:107)
10-May-2018 13:06:39     at org.apache.maven.cli.MavenCli.execute (MavenCli.java:955)
10-May-2018 13:06:39     at org.apache.maven.cli.MavenCli.doMain (MavenCli.java:290)
10-May-2018 13:06:39     at org.apache.maven.cli.MavenCli.main (MavenCli.java:194)
10-May-2018 13:06:39     at sun.reflect.NativeMethodAccessorImpl.invoke0 (Native Method)
10-May-2018 13:06:39     at sun.reflect.NativeMethodAccessorImpl.invoke (NativeMethodAccessorImpl.java:57)
10-May-2018 13:06:39     at sun.reflect.DelegatingMethodAccessorImpl.invoke (DelegatingMethodAccessorImpl.java:43)
10-May-2018 13:06:39     at java.lang.reflect.Method.invoke (Method.java:606)
10-May-2018 13:06:39     at org.codehaus.plexus.classworlds.launcher.Launcher.launchEnhanced (Launcher.java:289)
10-May-2018 13:06:39     at org.codehaus.plexus.classworlds.launcher.Launcher.launch (Launcher.java:229)
10-May-2018 13:06:39     at org.codehaus.plexus.classworlds.launcher.Launcher.mainWithExitCode (Launcher.java:415)
10-May-2018 13:06:39     at org.codehaus.plexus.classworlds.launcher.Launcher.main (Launcher.java:356)
10-May-2018 13:06:39 Caused by: java.lang.UnsupportedClassVersionError: com/carrotsearch/maven/plugins/junit4/JUnit4Mojo : Unsupported major.minor version 52.0
10-May-2018 13:06:39     at java.lang.ClassLoader.defineClass1 (Native Method)
10-May-2018 13:06:39     at java.lang.ClassLoader.defineClass (ClassLoader.java:800)
10-May-2018 13:06:39     at java.security.SecureClassLoader.defineClass (SecureClassLoader.java:142)
10-May-2018 13:06:39     at java.net.URLClassLoader.defineClass (URLClassLoader.java:449)
10-May-2018 13:06:39     at java.net.URLClassLoader.access$100 (URLClassLoader.java:71)
10-May-2018 13:06:39     at java.net.URLClassLoader$1.run (URLClassLoader.java:361)
10-May-2018 13:06:39     at java.net.URLClassLoader$1.run (URLClassLoader.java:355)
10-May-2018 13:06:39     at java.security.AccessController.doPrivileged (Native Method)
10-May-2018 13:06:39     at java.net.URLClassLoader.findClass (URLClassLoader.java:354)
10-May-2018 13:06:39     at org.codehaus.plexus.classworlds.realm.ClassRealm.loadClassFromSelf (ClassRealm.java:401)
10-May-2018 13:06:39     at org.codehaus.plexus.classworlds.strategy.SelfFirstStrategy.loadClass (SelfFirstStrategy.java:42)
10-May-2018 13:06:39     at org.codehaus.plexus.classworlds.realm.ClassRealm.unsynchronizedLoadClass (ClassRealm.java:271)
10-May-2018 13:06:39     at org.codehaus.plexus.classworlds.realm.ClassRealm.loadClass (ClassRealm.java:247)
10-May-2018 13:06:39     at org.codehaus.plexus.classworlds.realm.ClassRealm.loadClass (ClassRealm.java:239)
10-May-2018 13:06:39     at org.eclipse.sisu.space.URLClassSpace.loadClass (URLClassSpace.java:139)
10-May-2018 13:06:39     at org.eclipse.sisu.space.NamedClass.load (NamedClass.java:46)
10-May-2018 13:06:39     at org.eclipse.sisu.space.AbstractDeferredClass.get (AbstractDeferredClass.java:48)
10-May-2018 13:06:39     at com.google.inject.internal.ProviderInternalFactory.provision (ProviderInternalFactory.java:81)
10-May-2018 13:06:39     at com.google.inject.internal.InternalFactoryToInitializableAdapter.provision (InternalFactoryToInitializableAdapter.java:53)
10-May-2018 13:06:39     at com.google.inject.internal.ProviderInternalFactory$1.call (ProviderInternalFactory.java:65)
10-May-2018 13:06:39     at com.google.inject.internal.ProvisionListenerStackCallback$Provision.provision (ProvisionListenerStackCallback.java:115)
10-May-2018 13:06:39     at com.google.inject.internal.ProvisionListenerStackCallback$Provision.provision (ProvisionListenerStackCallback.java:133)
10-May-2018 13:06:39     at com.google.inject.internal.ProvisionListenerStackCallback.provision (ProvisionListenerStackCallback.java:68)
10-May-2018 13:06:39     at com.google.inject.internal.ProviderInternalFactory.circularGet (ProviderInternalFactory.java:63)
10-May-2018 13:06:39     at com.google.inject.internal.InternalFactoryToInitializableAdapter.get (InternalFactoryToInitializableAdapter.java:45)
10-May-2018 13:06:39     at com.google.inject.internal.InjectorImpl$2$1.call (InjectorImpl.java:1016)
10-May-2018 13:06:39     at com.google.inject.internal.InjectorImpl.callInContext (InjectorImpl.java:1092)
10-May-2018 13:06:39     at com.google.inject.internal.InjectorImpl$2.get (InjectorImpl.java:1012)
10-May-2018 13:06:39     at org.eclipse.sisu.inject.Guice4$1.get (Guice4.java:162)
10-May-2018 13:06:39     at org.eclipse.sisu.inject.LazyBeanEntry.getValue (LazyBeanEntry.java:81)
10-May-2018 13:06:39     at org.eclipse.sisu.plexus.LazyPlexusBean.getValue (LazyPlexusBean.java:51)
10-May-2018 13:06:39     at org.codehaus.plexus.DefaultPlexusContainer.lookup (DefaultPlexusContainer.java:263)
10-May-2018 13:06:39     at org.codehaus.plexus.DefaultPlexusContainer.lookup (DefaultPlexusContainer.java:255)
10-May-2018 13:06:39     at org.apache.maven.plugin.internal.DefaultMavenPluginManager.getConfiguredMojo (DefaultMavenPluginManager.java:519)
10-May-2018 13:06:39     at org.apache.maven.plugin.DefaultBuildPluginManager.executeMojo (DefaultBuildPluginManager.java:121)
10-May-2018 13:06:39     at org.apache.maven.lifecycle.internal.MojoExecutor.execute (MojoExecutor.java:208)
10-May-2018 13:06:39     at org.apache.maven.lifecycle.internal.MojoExecutor.execute (MojoExecutor.java:154)
10-May-2018 13:06:39     at org.apache.maven.lifecycle.internal.MojoExecutor.execute (MojoExecutor.java:146)
10-May-2018 13:06:39     at org.apache.maven.lifecycle.internal.LifecycleModuleBuilder.buildProject (LifecycleModuleBuilder.java:117)
10-May-2018 13:06:39     at org.apache.maven.lifecycle.internal.LifecycleModuleBuilder.buildProject (LifecycleModuleBuilder.java:81)
10-May-2018 13:06:39     at org.apache.maven.lifecycle.internal.builder.singlethreaded.SingleThreadedBuilder.build (SingleThreadedBuilder.java:51)
10-May-2018 13:06:39     at org.apache.maven.lifecycle.internal.LifecycleStarter.execute (LifecycleStarter.java:128)
10-May-2018 13:06:39     at org.apache.maven.DefaultMaven.doExecute (DefaultMaven.java:309)
10-May-2018 13:06:39     at org.apache.maven.DefaultMaven.doExecute (DefaultMaven.java:194)
10-May-2018 13:06:39     at org.apache.maven.DefaultMaven.execute (DefaultMaven.java:107)
10-May-2018 13:06:39     at org.apache.maven.cli.MavenCli.execute (MavenCli.java:955)
10-May-2018 13:06:39     at org.apache.maven.cli.MavenCli.doMain (MavenCli.java:290)
10-May-2018 13:06:39     at org.apache.maven.cli.MavenCli.main (MavenCli.java:194)
10-May-2018 13:06:39     at sun.reflect.NativeMethodAccessorImpl.invoke0 (Native Method)
10-May-2018 13:06:39     at sun.reflect.NativeMethodAccessorImpl.invoke (NativeMethodAccessorImpl.java:57)
10-May-2018 13:06:39     at sun.reflect.DelegatingMethodAccessorImpl.invoke (DelegatingMethodAccessorImpl.java:43)
10-May-2018 13:06:39     at java.lang.reflect.Method.invoke (Method.java:606)
10-May-2018 13:06:39     at org.codehaus.plexus.classworlds.launcher.Launcher.launchEnhanced (Launcher.java:289)
10-May-2018 13:06:39     at org.codehaus.plexus.classworlds.launcher.Launcher.launch (Launcher.java:229)
10-May-2018 13:06:39     at org.codehaus.plexus.classworlds.launcher.Launcher.mainWithExitCode (Launcher.java:415)
10-May-2018 13:06:39     at org.codehaus.plexus.classworlds.launcher.Launcher.main (Launcher.java:356)
10-May-2018 13:06:39 [INFO] ------------------------------------------------------------------------
10-May-2018 13:06:39 [INFO] Reactor Summary:
10-May-2018 13:06:39 [INFO]
10-May-2018 13:06:39 [INFO] Attributes parent POM .............................. SUCCESS [  7.764 s]
10-May-2018 13:06:39 [INFO] Attributes binder runtime .......................... SUCCESS [  6.152 s]
10-May-2018 13:06:39 [INFO] Attributes metadata annotation processor ........... SUCCESS [ 24.021 s]
10-May-2018 13:06:39 [INFO] Attributes integration tests ....................... FAILURE [ 16.949 s]
10-May-2018 13:06:39 [INFO] ------------------------------------------------------------------------
10-May-2018 13:06:39 [INFO] BUILD FAILURE
10-May-2018 13:06:39 [INFO] ------------------------------------------------------------------------
10-May-2018 13:06:39 [INFO] Total time: 54.989 s
10-May-2018 13:06:39 [INFO] Finished at: 2018-05-10T12:06:39+01:00
10-May-2018 13:06:39 [INFO] Final Memory: 31M/962M
10-May-2018 13:06:39 [INFO] ------------------------------------------------------------------------
10-May-2018 13:06:39 [ERROR] Failed to execute goal com.carrotsearch.randomizedtesting:junit4-maven-plugin:2.6.1:junit4 (integration-tests) on project attributes-tests: Execution integration-tests of goal com.carrotsearch.randomizedtesting:junit4-maven-plugin:2.6.1:junit4 failed: Unable to load the mojo 'junit4' in the plugin 'com.carrotsearch.randomizedtesting:junit4-maven-plugin:2.6.1' due to an API incompatibility: org.codehaus.plexus.component.repository.exception.ComponentLookupException: com/carrotsearch/maven/plugins/junit4/JUnit4Mojo : Unsupported major.minor version 52.0
10-May-2018 13:06:39 [ERROR] -----------------------------------------------------
10-May-2018 13:06:39 [ERROR] realm =    plugin>com.carrotsearch.randomizedtesting:junit4-maven-plugin:2.6.1
10-May-2018 13:06:39 [ERROR] strategy = org.codehaus.plexus.classworlds.strategy.SelfFirstStrategy
10-May-2018 13:06:39 [ERROR] urls[0] = file:/var/atlassian/application-data/bamboo/.m2/AGENT-61702145/repository/com/carrotsearch/randomizedtesting/junit4-maven-plugin/2.6.1/junit4-maven-plugin-2.6.1.jar
10-May-2018 13:06:39 [ERROR] urls[1] = file:/var/atlassian/application-data/bamboo/.m2/AGENT-61702145/repository/com/carrotsearch/randomizedtesting/junit4-ant/2.6.1/junit4-ant-2.6.1.jar
10-May-2018 13:06:39 [ERROR] urls[2] = file:/var/atlassian/application-data/bamboo/.m2/AGENT-61702145/repository/com/carrotsearch/randomizedtesting/randomizedtesting-runner/2.6.1/randomizedtesting-runner-2.6.1.jar
10-May-2018 13:06:39 [ERROR] urls[3] = file:/var/atlassian/application-data/bamboo/.m2/AGENT-61702145/repository/junit/junit/4.10/junit-4.10.jar
10-May-2018 13:06:39 [ERROR] urls[4] = file:/var/atlassian/application-data/bamboo/.m2/AGENT-61702145/repository/javax/enterprise/cdi-api/1.0/cdi-api-1.0.jar
10-May-2018 13:06:39 [ERROR] urls[5] = file:/var/atlassian/application-data/bamboo/.m2/AGENT-61702145/repository/org/eclipse/sisu/org.eclipse.sisu.inject/0.3.0.M1/org.eclipse.sisu.inject-0.3.0.M1.jar
10-May-2018 13:06:39 [ERROR] urls[6] = file:/var/atlassian/application-data/bamboo/.m2/AGENT-61702145/repository/org/eclipse/aether/aether-util/1.0.0.v20140518/aether-util-1.0.0.v20140518.jar
10-May-2018 13:06:39 [ERROR] urls[7] = file:/var/atlassian/application-data/bamboo/.m2/AGENT-61702145/repository/org/sonatype/sisu/sisu-guice/3.2.3/sisu-guice-3.2.3-no_aop.jar
10-May-2018 13:06:39 [ERROR] urls[8] = file:/var/atlassian/application-data/bamboo/.m2/AGENT-61702145/repository/aopalliance/aopalliance/1.0/aopalliance-1.0.jar
10-May-2018 13:06:39 [ERROR] urls[9] = file:/var/atlassian/application-data/bamboo/.m2/AGENT-61702145/repository/com/google/guava/guava/25.0-jre/guava-25.0-jre.jar
10-May-2018 13:06:39 [ERROR] urls[10] = file:/var/atlassian/application-data/bamboo/.m2/AGENT-61702145/repository/org/checkerframework/checker-compat-qual/2.0.0/checker-compat-qual-2.0.0.jar
10-May-2018 13:06:39 [ERROR] urls[11] = file:/var/atlassian/application-data/bamboo/.m2/AGENT-61702145/repository/org/codehaus/plexus/plexus-interpolation/1.21/plexus-interpolation-1.21.jar
10-May-2018 13:06:39 [ERROR] urls[12] = file:/var/atlassian/application-data/bamboo/.m2/AGENT-61702145/repository/org/codehaus/plexus/plexus-utils/3.0.20/plexus-utils-3.0.20.jar
10-May-2018 13:06:39 [ERROR] urls[13] = file:/var/atlassian/application-data/bamboo/.m2/AGENT-61702145/repository/org/codehaus/plexus/plexus-component-annotations/1.5.5/plexus-component-annotations-1.5.5.jar
10-May-2018 13:06:39 [ERROR] urls[14] = file:/var/atlassian/application-data/bamboo/.m2/AGENT-61702145/repository/org/sonatype/plexus/plexus-sec-dispatcher/1.3/plexus-sec-dispatcher-1.3.jar
10-May-2018 13:06:39 [ERROR] urls[15] = file:/var/atlassian/application-data/bamboo/.m2/AGENT-61702145/repository/org/sonatype/plexus/plexus-cipher/1.4/plexus-cipher-1.4.jar
10-May-2018 13:06:39 [ERROR] urls[16] = file:/var/atlassian/application-data/bamboo/.m2/AGENT-61702145/repository/org/apache/ant/ant/1.9.11/ant-1.9.11.jar
10-May-2018 13:06:39 [ERROR] urls[17] = file:/var/atlassian/application-data/bamboo/.m2/AGENT-61702145/repository/org/apache/ant/ant-launcher/1.9.11/ant-launcher-1.9.11.jar
10-May-2018 13:06:39 [ERROR] urls[18] = file:/var/atlassian/application-data/bamboo/.m2/AGENT-61702145/repository/org/apache/ant/ant-junit/1.9.11/ant-junit-1.9.11.jar
10-May-2018 13:06:39 [ERROR] urls[19] = file:/var/atlassian/application-data/bamboo/.m2/AGENT-61702145/repository/org/dom4j/dom4j/2.0.2/dom4j-2.0.2.jar
10-May-2018 13:06:39 [ERROR] urls[20] = file:/var/atlassian/application-data/bamboo/.m2/AGENT-61702145/repository/jaxen/jaxen/1.1.6/jaxen-1.1.6.jar
10-May-2018 13:06:39 [ERROR] urls[21] = file:/var/atlassian/application-data/bamboo/.m2/AGENT-61702145/repository/org/apache/maven/shared/maven-common-artifact-filters/3.0.0/maven-common-artifact-filters-3.0.0.jar
10-May-2018 13:06:39 [ERROR] urls[22] = file:/var/atlassian/application-data/bamboo/.m2/AGENT-61702145/repository/org/sonatype/sisu/sisu-inject-bean/1.4.2/sisu-inject-bean-1.4.2.jar
10-May-2018 13:06:39 [ERROR] urls[23] = file:/var/atlassian/application-data/bamboo/.m2/AGENT-61702145/repository/org/sonatype/sisu/sisu-guice/2.1.7/sisu-guice-2.1.7-noaop.jar
10-May-2018 13:06:39 [ERROR] urls[24] = file:/var/atlassian/application-data/bamboo/.m2/AGENT-61702145/repository/org/apache/maven/shared/maven-shared-utils/3.0.0/maven-shared-utils-3.0.0.jar
10-May-2018 13:06:39 [ERROR] urls[25] = file:/var/atlassian/application-data/bamboo/.m2/AGENT-61702145/repository/commons-io/commons-io/2.4/commons-io-2.4.jar
10-May-2018 13:06:39 [ERROR] urls[26] = file:/var/atlassian/application-data/bamboo/.m2/AGENT-61702145/repository/com/google/code/findbugs/jsr305/2.0.1/jsr305-2.0.1.jar
10-May-2018 13:06:39 [ERROR] urls[27] = file:/var/atlassian/application-data/bamboo/.m2/AGENT-61702145/repository/org/apache/maven/plugins/maven-antrun-plugin/1.8/maven-antrun-plugin-1.8.jar
10-May-2018 13:06:39 [ERROR] Number of foreign imports: 1
10-May-2018 13:06:39 [ERROR] import: Entry[import  from realm ClassRealm[maven.api, parent: null]]
10-May-2018 13:06:39 [ERROR]
10-May-2018 13:06:39 [ERROR] -----------------------------------------------------
10-May-2018 13:06:39 [ERROR] -> [Help 1]
10-May-2018 13:06:39 [ERROR]
10-May-2018 13:06:39 [ERROR] To see the full stack trace of the errors, re-run Maven with the -e switch.
10-May-2018 13:06:39 [ERROR] Re-run Maven using the -X switch to enable full debug logging.
10-May-2018 13:06:39 [ERROR]
10-May-2018 13:06:39 [ERROR] For more information about the errors and possible solutions, please read the following articles:
10-May-2018 13:06:39 [ERROR] [Help 1] http://cwiki.apache.org/confluence/display/MAVEN/PluginContainerException
10-May-2018 13:06:39 [ERROR]
10-May-2018 13:06:39 [ERROR] After correcting the problems, you can resume the build with the command
10-May-2018 13:06:39 [ERROR]   mvn <goals> -rf :attributes-tests
10-May-2018 13:06:39 Failing task since return code of [/home/bamboo/tools/apache-maven-3.5.2/bin/mvn --batch-mode -Djava.io.tmpdir=/opt/atlassian/bamboo/current/temp/C2-BINDER-JDK17 -Dmaven.repo.local=/var/atlassian/application-data/bamboo/.m2/AGENT-61702145/repository clean verify] was 1 while expected 0
10-May-2018 13:06:39 Parsing test results under /var/atlassian/application-data/bamboo/xml-data/build-dir/C2-BINDER-JDK17...
10-May-2018 13:06:39 Finished task 'Maven 3.x' with result: Failed
10-May-2018 13:06:39 Running post build plugin 'NCover Results Collector'
10-May-2018 13:06:39 Running post build plugin 'Artifact Copier'
10-May-2018 13:06:39 Running post build plugin 'npm Cache Cleanup'
10-May-2018 13:06:39 Running post build plugin 'Clover Results Collector'
10-May-2018 13:06:39 Running post build plugin 'Docker Container Cleanup'
10-May-2018 13:06:39 Finalising the build...
10-May-2018 13:06:39 Stopping timer.
10-May-2018 13:06:39 Build C2-BINDER-JDK17-28 completed.
10-May-2018 13:06:39 Running on server: post build plugin 'NCover Results Collector'
10-May-2018 13:06:39 Running on server: post build plugin 'Build Hanging Detection Configuration'
10-May-2018 13:06:39 Running on server: post build plugin 'Clover Delta Calculator'
10-May-2018 13:06:39 Running on server: post build plugin 'Maven Dependencies Postprocessor'
10-May-2018 13:06:39 All post build plugins have finished
10-May-2018 13:06:39 Generating build results summary...
10-May-2018 13:06:39 Saving build results to disk...
10-May-2018 13:06:39 Logging substituted variables...
10-May-2018 13:06:39 Indexing build results...
10-May-2018 13:06:39 Finished building C2-BINDER-JDK17-28.