Build: #10 failed

Job: JDK 1.8 failed

Stages & jobs

  1. Compile and test

Build log

The build generated 220 lines of output. Download or view full build log

10-Aug-2015 10:51:26 Build Carrot2 - Attribute Binder - JDK 1.7 #10 (C2-BINDER-JDK17-10) started building on agent Local Agent 3
10-Aug-2015 10:51:26 Build working directory is /mnt/work/bamboo-home/xml-data/build-dir/C2-BINDER-JDK17
10-Aug-2015 10:51:26 Executing build Carrot2 - Attribute Binder - JDK 1.7 #10 (C2-BINDER-JDK17-10)
10-Aug-2015 10:51:26 Starting task 'Checkout Default Repository' of type 'com.atlassian.bamboo.plugins.vcs:task.vcs.checkout'
10-Aug-2015 10:51:26 Updating source code to revision: 1575a2b5c4109c1482479891fb15a1b56d8ed60c
10-Aug-2015 10:51:26 Fetching 'refs/heads/master' from 'https://github.com/carrot2/attributes-binder.git'.
10-Aug-2015 10:51:27 Checking out revision 1575a2b5c4109c1482479891fb15a1b56d8ed60c.
10-Aug-2015 10:51:27 Warning: you are leaving 7 commits behind, not connected to
10-Aug-2015 10:51:27 any of your branches:
10-Aug-2015 10:51:27
10-Aug-2015 10:51:27   17806d7 LINGO-413: Use canonical names in implementingclasses constraint."
10-Aug-2015 10:51:27   0a1aa43 Bumping version to 1.2.1
10-Aug-2015 10:51:27   d4a4b3b Removed unused import.
10-Aug-2015 10:51:27   1217c1b Fixup LevelsPredicate for cases when there's no metadata.
10-Aug-2015 10:51:27 ... and 3 more.
10-Aug-2015 10:51:27
10-Aug-2015 10:51:27 If you want to keep them by creating a new branch, this may be a good time
10-Aug-2015 10:51:27 to do so with:
10-Aug-2015 10:51:27
10-Aug-2015 10:51:27 git branch new_branch_name 17806d77a92d796574f7cff9592f057ec8de0270
10-Aug-2015 10:51:27
10-Aug-2015 10:51:27 HEAD is now at 1575a2b... Don't include shaded guava.
10-Aug-2015 10:51:27 Updated source code to revision: 1575a2b5c4109c1482479891fb15a1b56d8ed60c
10-Aug-2015 10:51:27 Finished task 'Checkout Default Repository'
10-Aug-2015 10:51:27 Running pre-build action: Clover Grails PreBuild Action
10-Aug-2015 10:51:27 Running pre-build action: VCS Version Collector
10-Aug-2015 10:51:27 Starting task 'Maven 3.x' of type 'com.atlassian.bamboo.plugins.maven:task.builder.mvn3'
10-Aug-2015 10:51:27
Beginning to execute external process for build 'Carrot2 - Attribute Binder - JDK 1.7 #10 (C2-BINDER-JDK17-10)'
... running command line:
/home/bamboo/tools/apache-maven-3.2.5/bin/mvn --batch-mode -Djava.io.tmpdir=/home/bamboo/bamboo-software/temp/C2-BINDER-JDK17 -Dmaven.repo.local=/mnt/work/bamboo-home/.m2/AGENT-1146882/repository clean verify
... in: /mnt/work/bamboo-home/xml-data/build-dir/C2-BINDER-JDK17
... using extra environment variables:
bamboo_carrotsearch_download_staging_path=/srv/vhosts/staging-get.carrotsearch.com
bamboo_carrot2_download_host=gamma.carrotsearch.com
bamboo_carrotsearch_download_official_path=~/sites/download.carrotsearch.com
JAVA_HOME=/usr/lib/jvm/jdk7
bamboo_carrotsearch_labs_ssh=carrotse@site5.carrot2.org:~/sites/labs.carrotsearch.com
useMavenReturnCode=false
bamboo_carrotsearch_secure_ssh=seccarro@site5.carrot2.org:~/www
bamboo_carrot2_website_ssh=carrot2o@site5.carrot2.org:~/sites/project.carrot2.org
bamboo_carrotsearch_download_staging_user=bamboo
bamboo_carrot2_download_path=/srv/vhosts/get.carrot2.org
M2_HOME=/home/bamboo/tools/apache-maven-3.2.5
bamboo_carrotsearch_download_official_host=download.carrotsearch.com
bamboo_csssprites_download_user=bamboo
bamboo_carrotsearch_download_staging_host=gamma.carrotsearch.com
bamboo_csssprites_download_path=/srv/vhosts/get.csssprites.org
bamboo_carrot2_download_user=bamboo
MAVEN2_HOME=/home/bamboo/tools/apache-maven-3.2.5
bamboo_carrotsearch_website_ssh=carrotse@site5.carrot2.org:~/sites/www.carrotsearch.com
bamboo_l4g_mvn_opts=-Xmx1g
bamboo_carrotsearch_download_official_user=carrotse
bamboo_csssprites_download_host=gamma.carrotsearch.com
PATH=/usr/lib/jvm/jdk7/bin:/usr/local/bin:/usr/bin:/bin:/usr/local/games:/usr/games
10-Aug-2015 10:51:29 [INFO] Scanning for projects...
10-Aug-2015 10:51:29 [INFO] ------------------------------------------------------------------------
10-Aug-2015 10:51:29 [INFO] Reactor Build Order:
10-Aug-2015 10:51:29 [INFO]
10-Aug-2015 10:51:29 [INFO] Attributes parent POM
10-Aug-2015 10:51:29 [INFO] Attributes binder runtime
10-Aug-2015 10:51:29 [INFO] Attributes metadata annotation processor
10-Aug-2015 10:51:29 [INFO] Attributes integration tests
10-Aug-2015 10:51:29 [INFO]                                                                         
10-Aug-2015 10:51:29 [INFO] ------------------------------------------------------------------------
10-Aug-2015 10:51:29 [INFO] Building Attributes parent POM 1.2.3
10-Aug-2015 10:51:29 [INFO] ------------------------------------------------------------------------
10-Aug-2015 10:51:29 [INFO]
10-Aug-2015 10:51:29 [INFO] --- maven-clean-plugin:2.5:clean (default-clean) @ attributes-parent ---
10-Aug-2015 10:51:29 [INFO]
10-Aug-2015 10:51:29 [INFO] --- maven-enforcer-plugin:1.2:enforce (enforce-maven) @ attributes-parent ---
10-Aug-2015 10:51:29 [INFO]                                                                         
10-Aug-2015 10:51:29 [INFO] ------------------------------------------------------------------------
10-Aug-2015 10:51:29 [INFO] Building Attributes binder runtime 1.2.3
10-Aug-2015 10:51:29 [INFO] ------------------------------------------------------------------------
10-Aug-2015 10:51:29 [INFO] Downloading: https://repo.maven.apache.org/maven2/org/simpleframework/simple-xml/2.7/simple-xml-2.7.pom
10-Aug-2015 10:51:30 [INFO] Downloaded: https://repo.maven.apache.org/maven2/org/simpleframework/simple-xml/2.7/simple-xml-2.7.pom (5 KB at 10.9 KB/sec)
10-Aug-2015 10:51:30 [INFO] Downloading: https://repo.maven.apache.org/maven2/org/carrot2/shaded/guava/18.0/guava-18.0.pom
10-Aug-2015 10:51:30 [WARNING] The POM for org.carrot2.shaded:guava:jar:18.0 is missing, no dependency information available
10-Aug-2015 10:51:30 [INFO] Downloading: https://repo.maven.apache.org/maven2/org/simpleframework/simple-xml/2.7/simple-xml-2.7.jar
10-Aug-2015 10:51:30 [INFO] Downloading: https://repo.maven.apache.org/maven2/org/carrot2/shaded/guava/18.0/guava-18.0.jar
10-Aug-2015 10:51:30 [INFO] Downloaded: https://repo.maven.apache.org/maven2/org/simpleframework/simple-xml/2.7/simple-xml-2.7.jar (404 KB at 1155.8 KB/sec)
10-Aug-2015 10:51:30 [INFO] ------------------------------------------------------------------------
10-Aug-2015 10:51:30 [INFO] Reactor Summary:
10-Aug-2015 10:51:30 [INFO]
10-Aug-2015 10:51:30 [INFO] Attributes parent POM .............................. SUCCESS [  0.452 s]
10-Aug-2015 10:51:30 [INFO] Attributes binder runtime .......................... FAILURE [  1.078 s]
10-Aug-2015 10:51:30 [INFO] Attributes metadata annotation processor ........... SKIPPED
10-Aug-2015 10:51:30 [INFO] Attributes integration tests ....................... SKIPPED
10-Aug-2015 10:51:30 [INFO] ------------------------------------------------------------------------
10-Aug-2015 10:51:30 [INFO] BUILD FAILURE
10-Aug-2015 10:51:30 [INFO] ------------------------------------------------------------------------
10-Aug-2015 10:51:30 [INFO] Total time: 1.686 s
10-Aug-2015 10:51:30 [INFO] Finished at: 2015-08-10T10:51:30+02:00
10-Aug-2015 10:51:30 [INFO] Final Memory: 11M/481M
10-Aug-2015 10:51:30 [INFO] ------------------------------------------------------------------------
10-Aug-2015 10:51:30 [ERROR] Failed to execute goal on project attributes-binder: Could not resolve dependencies for project org.carrot2.attributes:attributes-binder:jar:1.2.3: Could not find artifact org.carrot2.shaded:guava:jar:18.0 in central (https://repo.maven.apache.org/maven2) -> [Help 1]
10-Aug-2015 10:51:30 [ERROR]
10-Aug-2015 10:51:30 [ERROR] To see the full stack trace of the errors, re-run Maven with the -e switch.
10-Aug-2015 10:51:30 [ERROR] Re-run Maven using the -X switch to enable full debug logging.
10-Aug-2015 10:51:30 [ERROR]
10-Aug-2015 10:51:30 [ERROR] For more information about the errors and possible solutions, please read the following articles:
10-Aug-2015 10:51:30 [ERROR] [Help 1] http://cwiki.apache.org/confluence/display/MAVEN/DependencyResolutionException
10-Aug-2015 10:51:30 [ERROR]
10-Aug-2015 10:51:30 [ERROR] After correcting the problems, you can resume the build with the command
10-Aug-2015 10:51:30 [ERROR]   mvn <goals> -rf :attributes-binder
10-Aug-2015 10:51:30 Failing task since return code of [/home/bamboo/tools/apache-maven-3.2.5/bin/mvn --batch-mode -Djava.io.tmpdir=/home/bamboo/bamboo-software/temp/C2-BINDER-JDK17 -Dmaven.repo.local=/mnt/work/bamboo-home/.m2/AGENT-1146882/repository clean verify] was 1 while expected 0
10-Aug-2015 10:51:30 Parsing test results...
10-Aug-2015 10:51:30 File /mnt/work/bamboo-home/xml-data/build-dir/C2-BINDER-JDK17/attributes-tests/target/surefire-reports/TEST-org.carrot2.util.attribute.AttributeBinderInjectorTest.xml was ignored because it was modified (Sat Apr 05 13:46:20 CEST 2014) before task started (Mon Aug 10 10:51:26 CEST 2015)
10-Aug-2015 10:51:30 File /mnt/work/bamboo-home/xml-data/build-dir/C2-BINDER-JDK17/attributes-tests/target/surefire-reports/TEST-org.carrot2.util.attribute.AttributeBinderTest.xml was ignored because it was modified (Sat Apr 05 13:46:20 CEST 2014) before task started (Mon Aug 10 10:51:26 CEST 2015)
10-Aug-2015 10:51:30 File /mnt/work/bamboo-home/xml-data/build-dir/C2-BINDER-JDK17/attributes-tests/target/surefire-reports/TEST-org.carrot2.util.attribute.AttributeTransformerFromStringTest.xml was ignored because it was modified (Sat Apr 05 13:46:20 CEST 2014) before task started (Mon Aug 10 10:51:26 CEST 2015)
10-Aug-2015 10:51:30 File /mnt/work/bamboo-home/xml-data/build-dir/C2-BINDER-JDK17/attributes-tests/target/surefire-reports/TEST-org.carrot2.util.attribute.BindableDescriptorBuilderTest.xml was ignored because it was modified (Sat Apr 05 13:46:20 CEST 2014) before task started (Mon Aug 10 10:51:26 CEST 2015)
10-Aug-2015 10:51:30 File /mnt/work/bamboo-home/xml-data/build-dir/C2-BINDER-JDK17/attributes-tests/target/surefire-reports/TEST-org.carrot2.util.attribute.BindableDescriptorGeneratorTest.xml was ignored because it was modified (Sat Apr 05 13:46:20 CEST 2014) before task started (Mon Aug 10 10:51:26 CEST 2015)
10-Aug-2015 10:51:30 File /mnt/work/bamboo-home/xml-data/build-dir/C2-BINDER-JDK17/attributes-tests/target/surefire-reports/TEST-org.carrot2.util.attribute.BindableDescriptorTest.xml was ignored because it was modified (Sat Apr 05 13:46:20 CEST 2014) before task started (Mon Aug 10 10:51:26 CEST 2015)
10-Aug-2015 10:51:30 File /mnt/work/bamboo-home/xml-data/build-dir/C2-BINDER-JDK17/attributes-tests/target/surefire-reports/TEST-org.carrot2.util.attribute.BindableDescriptorUtilsTest.xml was ignored because it was modified (Sat Apr 05 13:46:19 CEST 2014) before task started (Mon Aug 10 10:51:26 CEST 2015)
10-Aug-2015 10:51:30 File /mnt/work/bamboo-home/xml-data/build-dir/C2-BINDER-JDK17/attributes-tests/target/surefire-reports/TEST-org.carrot2.util.attribute.BindableMetadataBuilderTest.xml was ignored because it was modified (Sat Apr 05 13:46:20 CEST 2014) before task started (Mon Aug 10 10:51:26 CEST 2015)
10-Aug-2015 10:51:30 File /mnt/work/bamboo-home/xml-data/build-dir/C2-BINDER-JDK17/attributes-tests/target/surefire-reports/TEST-org.carrot2.util.attribute.ConstraintTest.xml was ignored because it was modified (Sat Apr 05 13:46:19 CEST 2014) before task started (Mon Aug 10 10:51:26 CEST 2015)
10-Aug-2015 10:51:30 File /mnt/work/bamboo-home/xml-data/build-dir/C2-BINDER-JDK17/attributes-tests/target/surefire-reports/TEST-org.carrot2.util.attribute.constraint.ConstraintCreatorTest.xml was ignored because it was modified (Sat Apr 05 13:46:19 CEST 2014) before task started (Mon Aug 10 10:51:26 CEST 2015)
10-Aug-2015 10:51:30 File /mnt/work/bamboo-home/xml-data/build-dir/C2-BINDER-JDK17/attributes-tests/target/surefire-reports/TEST-org.carrot2.util.attribute.constraint.DoubleRangeConstraintTest.xml was ignored because it was modified (Sat Apr 05 13:46:20 CEST 2014) before task started (Mon Aug 10 10:51:26 CEST 2015)
10-Aug-2015 10:51:30 File /mnt/work/bamboo-home/xml-data/build-dir/C2-BINDER-JDK17/attributes-tests/target/surefire-reports/TEST-org.carrot2.util.attribute.constraint.ImplementingClassesConstraintTest.xml was ignored because it was modified (Sat Apr 05 13:46:20 CEST 2014) before task started (Mon Aug 10 10:51:26 CEST 2015)
10-Aug-2015 10:51:30 File /mnt/work/bamboo-home/xml-data/build-dir/C2-BINDER-JDK17/attributes-tests/target/surefire-reports/TEST-org.carrot2.util.attribute.constraint.IntModuloConstraintTest.xml was ignored because it was modified (Sat Apr 05 13:46:19 CEST 2014) before task started (Mon Aug 10 10:51:26 CEST 2015)
10-Aug-2015 10:51:30 File /mnt/work/bamboo-home/xml-data/build-dir/C2-BINDER-JDK17/attributes-tests/target/surefire-reports/TEST-org.carrot2.util.attribute.constraint.IntRangeConstraintTest.xml was ignored because it was modified (Sat Apr 05 13:46:20 CEST 2014) before task started (Mon Aug 10 10:51:26 CEST 2015)
10-Aug-2015 10:51:30 File /mnt/work/bamboo-home/xml-data/build-dir/C2-BINDER-JDK17/attributes-tests/target/surefire-reports/TEST-org.carrot2.util.attribute.constraint.IsDirectoryConstraintTest.xml was ignored because it was modified (Sat Apr 05 13:46:20 CEST 2014) before task started (Mon Aug 10 10:51:26 CEST 2015)
10-Aug-2015 10:51:30 File /mnt/work/bamboo-home/xml-data/build-dir/C2-BINDER-JDK17/attributes-tests/target/surefire-reports/TEST-org.carrot2.util.attribute.constraint.IsFileConstraintTest.xml was ignored because it was modified (Sat Apr 05 13:46:19 CEST 2014) before task started (Mon Aug 10 10:51:26 CEST 2015)
10-Aug-2015 10:51:30 File /mnt/work/bamboo-home/xml-data/build-dir/C2-BINDER-JDK17/attributes-tests/target/surefire-reports/TEST-org.carrot2.util.attribute.constraint.NotBlankConstraintTest.xml was ignored because it was modified (Sat Apr 05 13:46:19 CEST 2014) before task started (Mon Aug 10 10:51:26 CEST 2015)
10-Aug-2015 10:51:30 File /mnt/work/bamboo-home/xml-data/build-dir/C2-BINDER-JDK17/attributes-tests/target/surefire-reports/TEST-org.carrot2.util.attribute.constraint.PassesValueOfConstraintTest.xml was ignored because it was modified (Sat Apr 05 13:46:19 CEST 2014) before task started (Mon Aug 10 10:51:26 CEST 2015)
10-Aug-2015 10:51:30 File /mnt/work/bamboo-home/xml-data/build-dir/C2-BINDER-JDK17/attributes-tests/target/surefire-reports/TEST-org.carrot2.util.attribute.constraint.ValueHintConstraintTest.xml was ignored because it was modified (Sat Apr 05 13:46:20 CEST 2014) before task started (Mon Aug 10 10:51:26 CEST 2015)
10-Aug-2015 10:51:30 File /mnt/work/bamboo-home/xml-data/build-dir/C2-BINDER-JDK17/attributes-tests/target/surefire-reports/TEST-org.carrot2.util.attribute.constraint.ValueHintWithMappedValuesConstraintTest.xml was ignored because it was modified (Sat Apr 05 13:46:19 CEST 2014) before task started (Mon Aug 10 10:51:26 CEST 2015)
10-Aug-2015 10:51:30 Finished task 'Maven 3.x'
10-Aug-2015 10:51:30 Running post build plugin 'NCover Results Collector'
10-Aug-2015 10:51:30 Running post build plugin 'Clover Results Collector'
10-Aug-2015 10:51:30 Running post build plugin 'Artifact Copier'
10-Aug-2015 10:51:30 Finalising the build...
10-Aug-2015 10:51:30 Stopping timer.
10-Aug-2015 10:51:30 Build C2-BINDER-JDK17-10 completed.
10-Aug-2015 10:51:30 Running on server: post build plugin 'NCover Results Collector'
10-Aug-2015 10:51:30 Running on server: post build plugin 'Clover Delta Calculator'
10-Aug-2015 10:51:30 Running on server: post build plugin 'Build Hanging Detection Configuration'
10-Aug-2015 10:51:30 Running on server: post build plugin 'Maven Dependencies Postprocessor'
10-Aug-2015 10:51:30 All post build plugins have finished
10-Aug-2015 10:51:30 Generating build results summary...
10-Aug-2015 10:51:30 Saving build results to disk...
10-Aug-2015 10:51:30 Indexing build results...
10-Aug-2015 10:51:30 Finished building C2-BINDER-JDK17-10.
10-Aug-2015 11:33:59 Build Carrot2 - Attribute Binder - JDK 1.7 #10 (C2-BINDER-JDK17-10) started building on agent Local Agent 2
10-Aug-2015 11:33:59 Build working directory is /mnt/work/bamboo-home/xml-data/build-dir/C2-BINDER-JDK17
10-Aug-2015 11:33:59 Executing build Carrot2 - Attribute Binder - JDK 1.7 #10 (C2-BINDER-JDK17-10)
10-Aug-2015 11:33:59 Starting task 'Checkout Default Repository' of type 'com.atlassian.bamboo.plugins.vcs:task.vcs.checkout'
10-Aug-2015 11:33:59 Updating source code to revision: 1575a2b5c4109c1482479891fb15a1b56d8ed60c
10-Aug-2015 11:34:00 Fetching 'refs/heads/master' from 'https://github.com/carrot2/attributes-binder.git'.
10-Aug-2015 11:34:01 Checking out revision 1575a2b5c4109c1482479891fb15a1b56d8ed60c.
10-Aug-2015 11:34:01 HEAD is now at 1575a2b... Don't include shaded guava.
10-Aug-2015 11:34:01 Updated source code to revision: 1575a2b5c4109c1482479891fb15a1b56d8ed60c
10-Aug-2015 11:34:01 Finished task 'Checkout Default Repository'
10-Aug-2015 11:34:01 Running pre-build action: Clover Grails PreBuild Action
10-Aug-2015 11:34:01 Running pre-build action: VCS Version Collector
10-Aug-2015 11:34:01 Starting task 'Maven 3.x' of type 'com.atlassian.bamboo.plugins.maven:task.builder.mvn3'
10-Aug-2015 11:34:01
Beginning to execute external process for build 'Carrot2 - Attribute Binder - JDK 1.7 #10 (C2-BINDER-JDK17-10)'
... running command line:
/home/bamboo/tools/apache-maven-3.2.5/bin/mvn --batch-mode -Djava.io.tmpdir=/home/bamboo/bamboo-software/temp/C2-BINDER-JDK17 -Dmaven.repo.local=/mnt/work/bamboo-home/.m2/AGENT-1146881/repository clean verify
... in: /mnt/work/bamboo-home/xml-data/build-dir/C2-BINDER-JDK17
... using extra environment variables:
bamboo_carrotsearch_download_staging_path=/srv/vhosts/staging-get.carrotsearch.com
bamboo_carrot2_download_host=gamma.carrotsearch.com
bamboo_carrotsearch_download_official_path=~/sites/download.carrotsearch.com
JAVA_HOME=/usr/lib/jvm/jdk7
bamboo_carrotsearch_labs_ssh=carrotse@site5.carrot2.org:~/sites/labs.carrotsearch.com
useMavenReturnCode=false
bamboo_carrotsearch_secure_ssh=seccarro@site5.carrot2.org:~/www
bamboo_carrot2_website_ssh=carrot2o@site5.carrot2.org:~/sites/project.carrot2.org
bamboo_carrotsearch_download_staging_user=bamboo
bamboo_carrot2_download_path=/srv/vhosts/get.carrot2.org
M2_HOME=/home/bamboo/tools/apache-maven-3.2.5
bamboo_carrotsearch_download_official_host=download.carrotsearch.com
bamboo_csssprites_download_user=bamboo
bamboo_carrotsearch_download_staging_host=gamma.carrotsearch.com
bamboo_csssprites_download_path=/srv/vhosts/get.csssprites.org
bamboo_carrot2_download_user=bamboo
MAVEN2_HOME=/home/bamboo/tools/apache-maven-3.2.5
bamboo_carrotsearch_website_ssh=carrotse@site5.carrot2.org:~/sites/www.carrotsearch.com
bamboo_l4g_mvn_opts=-Xmx1g
bamboo_carrotsearch_download_official_user=carrotse
bamboo_csssprites_download_host=gamma.carrotsearch.com
PATH=/usr/lib/jvm/jdk7/bin:/usr/local/bin:/usr/bin:/bin:/usr/local/games:/usr/games
10-Aug-2015 11:34:04 [INFO] Scanning for projects...
10-Aug-2015 11:34:04 [INFO] ------------------------------------------------------------------------
10-Aug-2015 11:34:04 [INFO] Reactor Build Order:
10-Aug-2015 11:34:04 [INFO]
10-Aug-2015 11:34:04 [INFO] Attributes parent POM
10-Aug-2015 11:34:04 [INFO] Attributes binder runtime
10-Aug-2015 11:34:04 [INFO] Attributes metadata annotation processor
10-Aug-2015 11:34:04 [INFO] Attributes integration tests
10-Aug-2015 11:34:04 [INFO]                                                                         
10-Aug-2015 11:34:04 [INFO] ------------------------------------------------------------------------
10-Aug-2015 11:34:04 [INFO] Building Attributes parent POM 1.2.3
10-Aug-2015 11:34:04 [INFO] ------------------------------------------------------------------------
10-Aug-2015 11:34:04 [INFO]
10-Aug-2015 11:34:04 [INFO] --- maven-clean-plugin:2.5:clean (default-clean) @ attributes-parent ---
10-Aug-2015 11:34:04 [INFO]
10-Aug-2015 11:34:04 [INFO] --- maven-enforcer-plugin:1.2:enforce (enforce-maven) @ attributes-parent ---
10-Aug-2015 11:34:05 [INFO]                                                                         
10-Aug-2015 11:34:05 [INFO] ------------------------------------------------------------------------
10-Aug-2015 11:34:05 [INFO] Building Attributes binder runtime 1.2.3
10-Aug-2015 11:34:05 [INFO] ------------------------------------------------------------------------
10-Aug-2015 11:34:05 [INFO] Downloading: https://repo.maven.apache.org/maven2/org/simpleframework/simple-xml/2.7/simple-xml-2.7.pom
10-Aug-2015 11:34:05 [INFO] Downloaded: https://repo.maven.apache.org/maven2/org/simpleframework/simple-xml/2.7/simple-xml-2.7.pom (5 KB at 11.0 KB/sec)
10-Aug-2015 11:34:05 [INFO] Downloading: https://repo.maven.apache.org/maven2/org/carrot2/shaded/guava/18.0/guava-18.0.pom
10-Aug-2015 11:34:05 [WARNING] The POM for org.carrot2.shaded:guava:jar:18.0 is missing, no dependency information available
10-Aug-2015 11:34:05 [INFO] Downloading: https://repo.maven.apache.org/maven2/org/simpleframework/simple-xml/2.7/simple-xml-2.7.jar
10-Aug-2015 11:34:05 [INFO] Downloading: https://repo.maven.apache.org/maven2/org/carrot2/shaded/guava/18.0/guava-18.0.jar
10-Aug-2015 11:34:06 [INFO] Downloaded: https://repo.maven.apache.org/maven2/org/simpleframework/simple-xml/2.7/simple-xml-2.7.jar (404 KB at 1477.6 KB/sec)
10-Aug-2015 11:34:06 [INFO] ------------------------------------------------------------------------
10-Aug-2015 11:34:06 [INFO] Reactor Summary:
10-Aug-2015 11:34:06 [INFO]
10-Aug-2015 11:34:06 [INFO] Attributes parent POM .............................. SUCCESS [  0.631 s]
10-Aug-2015 11:34:06 [INFO] Attributes binder runtime .......................... FAILURE [  0.965 s]
10-Aug-2015 11:34:06 [INFO] Attributes metadata annotation processor ........... SKIPPED
10-Aug-2015 11:34:06 [INFO] Attributes integration tests ....................... SKIPPED
10-Aug-2015 11:34:06 [INFO] ------------------------------------------------------------------------
10-Aug-2015 11:34:06 [INFO] BUILD FAILURE
10-Aug-2015 11:34:06 [INFO] ------------------------------------------------------------------------
10-Aug-2015 11:34:06 [INFO] Total time: 1.877 s
10-Aug-2015 11:34:06 [INFO] Finished at: 2015-08-10T11:34:06+02:00
10-Aug-2015 11:34:06 [INFO] Final Memory: 10M/481M
10-Aug-2015 11:34:06 [INFO] ------------------------------------------------------------------------
10-Aug-2015 11:34:06 [ERROR] Failed to execute goal on project attributes-binder: Could not resolve dependencies for project org.carrot2.attributes:attributes-binder:jar:1.2.3: Could not find artifact org.carrot2.shaded:guava:jar:18.0 in central (https://repo.maven.apache.org/maven2) -> [Help 1]
10-Aug-2015 11:34:06 [ERROR]
10-Aug-2015 11:34:06 [ERROR] To see the full stack trace of the errors, re-run Maven with the -e switch.
10-Aug-2015 11:34:06 [ERROR] Re-run Maven using the -X switch to enable full debug logging.
10-Aug-2015 11:34:06 [ERROR]
10-Aug-2015 11:34:06 [ERROR] For more information about the errors and possible solutions, please read the following articles:
10-Aug-2015 11:34:06 [ERROR] [Help 1] http://cwiki.apache.org/confluence/display/MAVEN/DependencyResolutionException
10-Aug-2015 11:34:06 [ERROR]
10-Aug-2015 11:34:06 [ERROR] After correcting the problems, you can resume the build with the command
10-Aug-2015 11:34:06 [ERROR]   mvn <goals> -rf :attributes-binder
10-Aug-2015 11:34:06 Failing task since return code of [/home/bamboo/tools/apache-maven-3.2.5/bin/mvn --batch-mode -Djava.io.tmpdir=/home/bamboo/bamboo-software/temp/C2-BINDER-JDK17 -Dmaven.repo.local=/mnt/work/bamboo-home/.m2/AGENT-1146881/repository clean verify] was 1 while expected 0
10-Aug-2015 11:34:06 Parsing test results...
10-Aug-2015 11:34:06 File /mnt/work/bamboo-home/xml-data/build-dir/C2-BINDER-JDK17/attributes-tests/target/surefire-reports/TEST-org.carrot2.util.attribute.AttributeBinderInjectorTest.xml was ignored because it was modified (Sat Apr 05 13:46:20 CEST 2014) before task started (Mon Aug 10 11:33:59 CEST 2015)
10-Aug-2015 11:34:06 File /mnt/work/bamboo-home/xml-data/build-dir/C2-BINDER-JDK17/attributes-tests/target/surefire-reports/TEST-org.carrot2.util.attribute.AttributeBinderTest.xml was ignored because it was modified (Sat Apr 05 13:46:20 CEST 2014) before task started (Mon Aug 10 11:33:59 CEST 2015)
10-Aug-2015 11:34:06 File /mnt/work/bamboo-home/xml-data/build-dir/C2-BINDER-JDK17/attributes-tests/target/surefire-reports/TEST-org.carrot2.util.attribute.AttributeTransformerFromStringTest.xml was ignored because it was modified (Sat Apr 05 13:46:20 CEST 2014) before task started (Mon Aug 10 11:33:59 CEST 2015)
10-Aug-2015 11:34:06 File /mnt/work/bamboo-home/xml-data/build-dir/C2-BINDER-JDK17/attributes-tests/target/surefire-reports/TEST-org.carrot2.util.attribute.BindableDescriptorBuilderTest.xml was ignored because it was modified (Sat Apr 05 13:46:20 CEST 2014) before task started (Mon Aug 10 11:33:59 CEST 2015)
10-Aug-2015 11:34:06 File /mnt/work/bamboo-home/xml-data/build-dir/C2-BINDER-JDK17/attributes-tests/target/surefire-reports/TEST-org.carrot2.util.attribute.BindableDescriptorGeneratorTest.xml was ignored because it was modified (Sat Apr 05 13:46:20 CEST 2014) before task started (Mon Aug 10 11:33:59 CEST 2015)
10-Aug-2015 11:34:06 File /mnt/work/bamboo-home/xml-data/build-dir/C2-BINDER-JDK17/attributes-tests/target/surefire-reports/TEST-org.carrot2.util.attribute.BindableDescriptorTest.xml was ignored because it was modified (Sat Apr 05 13:46:20 CEST 2014) before task started (Mon Aug 10 11:33:59 CEST 2015)
10-Aug-2015 11:34:06 File /mnt/work/bamboo-home/xml-data/build-dir/C2-BINDER-JDK17/attributes-tests/target/surefire-reports/TEST-org.carrot2.util.attribute.BindableDescriptorUtilsTest.xml was ignored because it was modified (Sat Apr 05 13:46:19 CEST 2014) before task started (Mon Aug 10 11:33:59 CEST 2015)
10-Aug-2015 11:34:06 File /mnt/work/bamboo-home/xml-data/build-dir/C2-BINDER-JDK17/attributes-tests/target/surefire-reports/TEST-org.carrot2.util.attribute.BindableMetadataBuilderTest.xml was ignored because it was modified (Sat Apr 05 13:46:20 CEST 2014) before task started (Mon Aug 10 11:33:59 CEST 2015)
10-Aug-2015 11:34:06 File /mnt/work/bamboo-home/xml-data/build-dir/C2-BINDER-JDK17/attributes-tests/target/surefire-reports/TEST-org.carrot2.util.attribute.ConstraintTest.xml was ignored because it was modified (Sat Apr 05 13:46:19 CEST 2014) before task started (Mon Aug 10 11:33:59 CEST 2015)
10-Aug-2015 11:34:06 File /mnt/work/bamboo-home/xml-data/build-dir/C2-BINDER-JDK17/attributes-tests/target/surefire-reports/TEST-org.carrot2.util.attribute.constraint.ConstraintCreatorTest.xml was ignored because it was modified (Sat Apr 05 13:46:19 CEST 2014) before task started (Mon Aug 10 11:33:59 CEST 2015)
10-Aug-2015 11:34:06 File /mnt/work/bamboo-home/xml-data/build-dir/C2-BINDER-JDK17/attributes-tests/target/surefire-reports/TEST-org.carrot2.util.attribute.constraint.DoubleRangeConstraintTest.xml was ignored because it was modified (Sat Apr 05 13:46:20 CEST 2014) before task started (Mon Aug 10 11:33:59 CEST 2015)
10-Aug-2015 11:34:06 File /mnt/work/bamboo-home/xml-data/build-dir/C2-BINDER-JDK17/attributes-tests/target/surefire-reports/TEST-org.carrot2.util.attribute.constraint.ImplementingClassesConstraintTest.xml was ignored because it was modified (Sat Apr 05 13:46:20 CEST 2014) before task started (Mon Aug 10 11:33:59 CEST 2015)
10-Aug-2015 11:34:06 File /mnt/work/bamboo-home/xml-data/build-dir/C2-BINDER-JDK17/attributes-tests/target/surefire-reports/TEST-org.carrot2.util.attribute.constraint.IntModuloConstraintTest.xml was ignored because it was modified (Sat Apr 05 13:46:19 CEST 2014) before task started (Mon Aug 10 11:33:59 CEST 2015)
10-Aug-2015 11:34:06 File /mnt/work/bamboo-home/xml-data/build-dir/C2-BINDER-JDK17/attributes-tests/target/surefire-reports/TEST-org.carrot2.util.attribute.constraint.IntRangeConstraintTest.xml was ignored because it was modified (Sat Apr 05 13:46:20 CEST 2014) before task started (Mon Aug 10 11:33:59 CEST 2015)
10-Aug-2015 11:34:06 File /mnt/work/bamboo-home/xml-data/build-dir/C2-BINDER-JDK17/attributes-tests/target/surefire-reports/TEST-org.carrot2.util.attribute.constraint.IsDirectoryConstraintTest.xml was ignored because it was modified (Sat Apr 05 13:46:20 CEST 2014) before task started (Mon Aug 10 11:33:59 CEST 2015)
10-Aug-2015 11:34:06 File /mnt/work/bamboo-home/xml-data/build-dir/C2-BINDER-JDK17/attributes-tests/target/surefire-reports/TEST-org.carrot2.util.attribute.constraint.IsFileConstraintTest.xml was ignored because it was modified (Sat Apr 05 13:46:19 CEST 2014) before task started (Mon Aug 10 11:33:59 CEST 2015)
10-Aug-2015 11:34:06 File /mnt/work/bamboo-home/xml-data/build-dir/C2-BINDER-JDK17/attributes-tests/target/surefire-reports/TEST-org.carrot2.util.attribute.constraint.NotBlankConstraintTest.xml was ignored because it was modified (Sat Apr 05 13:46:19 CEST 2014) before task started (Mon Aug 10 11:33:59 CEST 2015)
10-Aug-2015 11:34:06 File /mnt/work/bamboo-home/xml-data/build-dir/C2-BINDER-JDK17/attributes-tests/target/surefire-reports/TEST-org.carrot2.util.attribute.constraint.PassesValueOfConstraintTest.xml was ignored because it was modified (Sat Apr 05 13:46:19 CEST 2014) before task started (Mon Aug 10 11:33:59 CEST 2015)
10-Aug-2015 11:34:06 File /mnt/work/bamboo-home/xml-data/build-dir/C2-BINDER-JDK17/attributes-tests/target/surefire-reports/TEST-org.carrot2.util.attribute.constraint.ValueHintConstraintTest.xml was ignored because it was modified (Sat Apr 05 13:46:20 CEST 2014) before task started (Mon Aug 10 11:33:59 CEST 2015)
10-Aug-2015 11:34:06 File /mnt/work/bamboo-home/xml-data/build-dir/C2-BINDER-JDK17/attributes-tests/target/surefire-reports/TEST-org.carrot2.util.attribute.constraint.ValueHintWithMappedValuesConstraintTest.xml was ignored because it was modified (Sat Apr 05 13:46:19 CEST 2014) before task started (Mon Aug 10 11:33:59 CEST 2015)
10-Aug-2015 11:34:06 Finished task 'Maven 3.x'
10-Aug-2015 11:34:06 Running post build plugin 'NCover Results Collector'
10-Aug-2015 11:34:06 Running post build plugin 'Clover Results Collector'
10-Aug-2015 11:34:06 Running post build plugin 'Artifact Copier'
10-Aug-2015 11:34:06 Finalising the build...
10-Aug-2015 11:34:06 Stopping timer.
10-Aug-2015 11:34:06 Build C2-BINDER-JDK17-10 completed.
10-Aug-2015 11:34:06 Running on server: post build plugin 'NCover Results Collector'
10-Aug-2015 11:34:06 Running on server: post build plugin 'Clover Delta Calculator'
10-Aug-2015 11:34:06 Running on server: post build plugin 'Build Hanging Detection Configuration'
10-Aug-2015 11:34:06 Running on server: post build plugin 'Maven Dependencies Postprocessor'
10-Aug-2015 11:34:06 All post build plugins have finished
10-Aug-2015 11:34:06 Generating build results summary...
10-Aug-2015 11:34:06 Saving build results to disk...
10-Aug-2015 11:34:06 Indexing build results...
10-Aug-2015 11:34:06 Finished building C2-BINDER-JDK17-10.