Build: #32 failed Changes by Dawid Weiss

Logs

The following logs have been generated by the jobs in this plan.
  • Expand all
  • Collapse all
Job Logs
Collapse JDK 1.8 Compile and test Download or View
20-Feb-2020 10:19:22 [INFO] Execution time total: 5.97 sec.
20-Feb-2020 10:19:22 [INFO] Tests summary: 20 suites, 201 tests, 2 errors
20-Feb-2020 10:19:22 [INFO] ------------------------------------------------------------------------
20-Feb-2020 10:19:22 [INFO] Reactor Summary for Attributes parent POM 1.3.5-SNAPSHOT:
20-Feb-2020 10:19:22 [INFO]
20-Feb-2020 10:19:22 [INFO] Attributes parent POM .............................. SUCCESS [  0.437 s]
20-Feb-2020 10:19:22 [INFO] Attributes binder runtime .......................... SUCCESS [  1.160 s]
20-Feb-2020 10:19:22 [INFO] Attributes metadata annotation processor ........... SUCCESS [  1.242 s]
20-Feb-2020 10:19:22 [INFO] Attributes integration tests ....................... FAILURE [ 13.412 s]
20-Feb-2020 10:19:22 [INFO] ------------------------------------------------------------------------
20-Feb-2020 10:19:22 [INFO] BUILD FAILURE
20-Feb-2020 10:19:22 [INFO] ------------------------------------------------------------------------
20-Feb-2020 10:19:22 [INFO] Total time:  16.374 s
20-Feb-2020 10:19:22 [INFO] Finished at: 2020-02-20T10:19:22+01:00
20-Feb-2020 10:19:22 [INFO] ------------------------------------------------------------------------
20-Feb-2020 10:19:22 [ERROR] Failed to execute goal com.carrotsearch.randomizedtesting:junit4-maven-plugin:2.5.3:junit4 (integration-tests) on project attributes-tests: There were test failures: 20 suites, 201 tests, 2 errors [seed: B666DD6E9D9EE608] -> [Help 1]
20-Feb-2020 10:19:22 [ERROR]
20-Feb-2020 10:19:22 [ERROR] To see the full stack trace of the errors, re-run Maven with the -e switch.
20-Feb-2020 10:19:22 [ERROR] Re-run Maven using the -X switch to enable full debug logging.
20-Feb-2020 10:19:22 [ERROR]
20-Feb-2020 10:19:22 [ERROR] For more information about the errors and possible solutions, please read the following articles:
20-Feb-2020 10:19:22 [ERROR] [Help 1] http://cwiki.apache.org/confluence/display/MAVEN/MojoExecutionException
20-Feb-2020 10:19:22 [ERROR]
20-Feb-2020 10:19:22 [ERROR] After correcting the problems, you can resume the build with the command
20-Feb-2020 10:19:22 [ERROR]   mvn <goals> -rf :attributes-tests