Build: #28 failed Manual run by Dawid Weiss

Logs

The following logs have been generated by the jobs in this plan.
  • Expand all
  • Collapse all
Job Logs
Collapse JDK 1.7 Compile and test Download or View
10-May-2018 13:06:39 [ERROR] urls[17] = file:/var/atlassian/application-data/bamboo/.m2/AGENT-61702145/repository/org/apache/ant/ant-launcher/1.9.11/ant-launcher-1.9.11.jar
10-May-2018 13:06:39 [ERROR] urls[18] = file:/var/atlassian/application-data/bamboo/.m2/AGENT-61702145/repository/org/apache/ant/ant-junit/1.9.11/ant-junit-1.9.11.jar
10-May-2018 13:06:39 [ERROR] urls[19] = file:/var/atlassian/application-data/bamboo/.m2/AGENT-61702145/repository/org/dom4j/dom4j/2.0.2/dom4j-2.0.2.jar
10-May-2018 13:06:39 [ERROR] urls[20] = file:/var/atlassian/application-data/bamboo/.m2/AGENT-61702145/repository/jaxen/jaxen/1.1.6/jaxen-1.1.6.jar
10-May-2018 13:06:39 [ERROR] urls[21] = file:/var/atlassian/application-data/bamboo/.m2/AGENT-61702145/repository/org/apache/maven/shared/maven-common-artifact-filters/3.0.0/maven-common-artifact-filters-3.0.0.jar
10-May-2018 13:06:39 [ERROR] urls[22] = file:/var/atlassian/application-data/bamboo/.m2/AGENT-61702145/repository/org/sonatype/sisu/sisu-inject-bean/1.4.2/sisu-inject-bean-1.4.2.jar
10-May-2018 13:06:39 [ERROR] urls[23] = file:/var/atlassian/application-data/bamboo/.m2/AGENT-61702145/repository/org/sonatype/sisu/sisu-guice/2.1.7/sisu-guice-2.1.7-noaop.jar
10-May-2018 13:06:39 [ERROR] urls[24] = file:/var/atlassian/application-data/bamboo/.m2/AGENT-61702145/repository/org/apache/maven/shared/maven-shared-utils/3.0.0/maven-shared-utils-3.0.0.jar
10-May-2018 13:06:39 [ERROR] urls[25] = file:/var/atlassian/application-data/bamboo/.m2/AGENT-61702145/repository/commons-io/commons-io/2.4/commons-io-2.4.jar
10-May-2018 13:06:39 [ERROR] urls[26] = file:/var/atlassian/application-data/bamboo/.m2/AGENT-61702145/repository/com/google/code/findbugs/jsr305/2.0.1/jsr305-2.0.1.jar
10-May-2018 13:06:39 [ERROR] urls[27] = file:/var/atlassian/application-data/bamboo/.m2/AGENT-61702145/repository/org/apache/maven/plugins/maven-antrun-plugin/1.8/maven-antrun-plugin-1.8.jar
10-May-2018 13:06:39 [ERROR] Number of foreign imports: 1
10-May-2018 13:06:39 [ERROR] import: Entry[import  from realm ClassRealm[maven.api, parent: null]]
10-May-2018 13:06:39 [ERROR]
10-May-2018 13:06:39 [ERROR] -----------------------------------------------------
10-May-2018 13:06:39 [ERROR] -> [Help 1]
10-May-2018 13:06:39 [ERROR]
10-May-2018 13:06:39 [ERROR] To see the full stack trace of the errors, re-run Maven with the -e switch.
10-May-2018 13:06:39 [ERROR] Re-run Maven using the -X switch to enable full debug logging.
10-May-2018 13:06:39 [ERROR]
10-May-2018 13:06:39 [ERROR] For more information about the errors and possible solutions, please read the following articles:
10-May-2018 13:06:39 [ERROR] [Help 1] http://cwiki.apache.org/confluence/display/MAVEN/PluginContainerException
10-May-2018 13:06:39 [ERROR]
10-May-2018 13:06:39 [ERROR] After correcting the problems, you can resume the build with the command
10-May-2018 13:06:39 [ERROR]   mvn <goals> -rf :attributes-tests