Build: #10 failed Rebuilt by Dawid Weiss

Logs

The following logs have been generated by the jobs in this plan.
  • Expand all
  • Collapse all
Job Logs
Collapse JDK 1.8 Compile and test Download or View
10-Aug-2015 11:34:06 [INFO] Downloaded: https://repo.maven.apache.org/maven2/org/simpleframework/simple-xml/2.7/simple-xml-2.7.jar (404 KB at 1477.6 KB/sec)
10-Aug-2015 11:34:06 [INFO] ------------------------------------------------------------------------
10-Aug-2015 11:34:06 [INFO] Reactor Summary:
10-Aug-2015 11:34:06 [INFO]
10-Aug-2015 11:34:06 [INFO] Attributes parent POM .............................. SUCCESS [  0.631 s]
10-Aug-2015 11:34:06 [INFO] Attributes binder runtime .......................... FAILURE [  0.965 s]
10-Aug-2015 11:34:06 [INFO] Attributes metadata annotation processor ........... SKIPPED
10-Aug-2015 11:34:06 [INFO] Attributes integration tests ....................... SKIPPED
10-Aug-2015 11:34:06 [INFO] ------------------------------------------------------------------------
10-Aug-2015 11:34:06 [INFO] BUILD FAILURE
10-Aug-2015 11:34:06 [INFO] ------------------------------------------------------------------------
10-Aug-2015 11:34:06 [INFO] Total time: 1.877 s
10-Aug-2015 11:34:06 [INFO] Finished at: 2015-08-10T11:34:06+02:00
10-Aug-2015 11:34:06 [INFO] Final Memory: 10M/481M
10-Aug-2015 11:34:06 [INFO] ------------------------------------------------------------------------
10-Aug-2015 11:34:06 [ERROR] Failed to execute goal on project attributes-binder: Could not resolve dependencies for project org.carrot2.attributes:attributes-binder:jar:1.2.3: Could not find artifact org.carrot2.shaded:guava:jar:18.0 in central (https://repo.maven.apache.org/maven2) -> [Help 1]
10-Aug-2015 11:34:06 [ERROR]
10-Aug-2015 11:34:06 [ERROR] To see the full stack trace of the errors, re-run Maven with the -e switch.
10-Aug-2015 11:34:06 [ERROR] Re-run Maven using the -X switch to enable full debug logging.
10-Aug-2015 11:34:06 [ERROR]
10-Aug-2015 11:34:06 [ERROR] For more information about the errors and possible solutions, please read the following articles:
10-Aug-2015 11:34:06 [ERROR] [Help 1] http://cwiki.apache.org/confluence/display/MAVEN/DependencyResolutionException
10-Aug-2015 11:34:06 [ERROR]
10-Aug-2015 11:34:06 [ERROR] After correcting the problems, you can resume the build with the command
10-Aug-2015 11:34:06 [ERROR]   mvn <goals> -rf :attributes-binder